program: Gaussian 09
title: 000178690
version: EM64L-G09RevD.01
frameworkgroup: C1[X(C16H14O4)]
method: RPBEPBE
basis: SDD
operation: Freq
keyword: #pfreq=noraman
keyword: PBEPBE/SDD
title: #p freq=noraman PBEPBE/SDD
converged: YES YES NO NO
title: Mulliken charges:
elementType: O O O O C C C C C C C C C C C C C C C C H H H H H H H H H H H H H H
charge: -0.427929 -0.470178 -0.473349 -0.438677 -0.176282 -0.192833 -0.047865 -0.141105 -0.285825 0.418765 0.279445 0.232118 0.177031 -0.403273 -0.426673 -0.461902 -0.403847 -0.217197 -0.232197 -0.233960 0.248736 0.243935 0.260434 0.261102 0.367888 0.244933 0.284959 0.373454 0.242679 0.228210 0.369289 0.344578 0.228248 0.227286
chargesum: 0.00000
title: Mulliken charges with hydrogens summed into heavy atoms:
elementType: O O O O C C C C C C C C C C C C C C C C
charge: -0.060041 -0.096724 -0.104060 -0.094098 -0.176282 0.055903 -0.047865 0.102831 -0.025391 0.418765 0.279445 0.232118 0.177031 -0.142171 -0.181740 -0.176942 -0.161168 0.011013 -0.003950 -0.006674
polarizability: 2.47904706e+02 1.73683049e+01 2.10921495e+02 4.02838260e+00 -2.22214998e+00 9.53502331e+01
1716.lowfreq: -8.2636 -4.6590 0.0003 0.0005 0.0008 7.4420 54.5460 84.0011 109.7305
frequency: 54.5283 83.9985 109.7259 118.7416 142.4315 162.5692 212.9869 218.8257 243.8228 251.3091 275.6061 310.4484 332.6270 355.2364 363.5303 369.8625 384.6099 415.2450 434.3420 447.0140 456.8253 465.6496 492.8062 519.1841 549.8882 567.1176 583.2642 592.0642 634.2225 647.2355 676.0137 735.3100 752.7374 764.6573 777.5683 781.4875 829.2957 861.9249 892.5384 902.7264 915.6246 920.0356 943.5672 962.0156 984.1238 993.2411 1000.8405 1003.2907 1020.6299 1030.0178 1038.9770 1065.6048 1085.5509 1090.7023 1117.2618 1166.2296 1172.0759 1177.6143 1187.7421 1199.9595 1206.5115 1221.6692 1231.6289 1268.8038 1274.7614 1294.4492 1298.2228 1332.9122 1352.4352 1366.3104 1373.7499 1377.0751 1380.9568 1403.5964 1432.3654 1449.7539 1469.2084 1485.5017 1592.8414 1607.6129 1618.0099 1619.2326 2982.3075 2998.6167 3022.1087 3124.8535 3128.9280 3136.6392 3143.5503 3150.7673 3160.3379 3164.7683 3481.3140 3529.8053 3541.8746 3566.3496
redmass: 5.9673 5.4841 4.5559 5.8308 5.6658 4.3460 5.0082 4.3837 3.8200 4.7046 4.7034 4.9565 4.5088 4.9677 1.2473 3.2802 6.0069 2.7814 1.6008 3.1113 1.3991 3.2292 1.3090 3.7824 4.0219 4.3947 3.9338 3.4704 6.4081 6.4232 5.4151 4.2750 3.8719 1.8432 1.5100 2.9552 2.7042 4.2910 1.8750 2.9439 3.1557 2.0339 5.6880 1.4645 1.3586 1.3563 5.4997 4.2147 2.2827 2.6633 3.1365 2.7926 3.3859 2.7797 1.7319 1.4035 1.1164 1.5682 1.3599 1.8891 1.3631 1.5292 1.2592 2.0380 1.5743 1.9417 1.2947 1.6539 1.3811 1.2069 1.6573 5.4812 1.5860 3.6345 2.4454 2.7813 3.2322 4.2565 6.8076 7.3277 8.1947 7.8936 1.0821 1.0850 1.0842 1.0858 1.0861 1.0902 1.0919 1.0946 1.0987 1.1000 1.0646 1.0652 1.0660 1.0658
irintensity: 0.9729 2.6693 2.0264 2.1073 2.9832 1.3318 10.6370 5.3879 6.6777 6.1536 4.6964 10.2962 1.8768 2.0663 45.0910 13.9669 0.3528 37.8973 142.0421 7.9281 111.4029 22.4875 156.2536 22.6884 1.2547 6.1132 4.1582 18.4585 6.3644 9.3803 17.6532 53.0299 4.4165 16.3944 115.2243 29.1085 13.9220 53.9227 13.2955 14.0487 44.5076 22.4732 60.8261 4.7452 0.8424 0.6196 30.0729 17.0349 19.4580 75.5178 19.2985 39.5970 13.0989 9.5205 9.5749 24.7081 13.8582 15.0282 9.6045 43.5379 10.6114 8.9493 8.8010 10.3640 20.8133 8.4266 18.5353 35.8640 7.2092 43.3204 20.0680 10.3410 12.6743 2.1781 23.5616 10.2020 0.9568 1.9642 0.1419 7.0716 4.4474 7.1419 4.2335 29.5487 18.8864 1.9758 4.5520 8.7351 7.2699 19.3496 28.9467 29.2793 27.5537 35.2236 11.1088 22.4638
temp: 298.150 k
press: 1.00000 atm
elementType: 8 8 8 8 6 6 6 6 6 6 6 6 6 6 6 6 6 6 6 6 1 1 1 1 1 1 1 1 1 1 1 1 1 1
symmnumber: 1
zpe: 691650.4 jmol-1
zpe.correction: 0.263436 hartree
zpe.thermalcorrener: 0.279616 hartree
zpe.thermalcorrenthalpy: 0.280561 hartree
zpe.thermalcorrgfe: 0.221355 hartree
zpe.sumelectzpe: -917.571463 hartree
zpe.sumelectthermal: -917.555282 hartree
zpe.sumelectthermalent: -917.554338 hartree
zpe.sumelectthermalfe: -917.613543 hartree
dipole: 0.0438 0.6985 -0.4117
dipole: 0.8120
quadrupole: -105.3658 -103.8983 -120.7489
quadrupole: -3.3492 5.1268 -2.5427
quadrupole: 4.6385 6.1061 -10.7446 -3.3492 5.1268 -2.5427
hfenergy: -917.8348983 hartree
pointgroup: C01 [X(C16H14O4)]
dipole: -0.029733 0.2747407 0.1603069 debye
polarizability: 249.3276367|-15.6661142|209.4966908|4.4837829|1.6902445|95.3521063 unknown
InChI: InChI=1S/C16H14O4/c17-13-10-6-3-5-9-8-4-1-2-7-11(8)16(20,12(9)10)15(19)14(13)18/h1-7,13-15,17-20H
charge 0 multiplicity 1
34 atoms
O  -0.105394 -1.162336 -1.7607
O  -0.529617 -3.097605 0.16941
O  -3.157647 -2.386034 0.74473
O  -4.066175 0.285795 -0.379885
C  0.061884 -0.789737 -0.323297
C  -0.866465 -1.705059 0.491992
C  -0.39238 0.650439 -0.152254
C  -2.315898 -1.405622 0.042656
C  -2.787864 0.038751 0.330453
C  1.559908 -0.684813 -0.018989
C  -1.70946 1.079531 0.055628
C  0.720411 1.528198 -0.074046
C  1.945887 0.692647 -0.002564
C  -1.935151 2.4788 0.174571
C  0.496197 2.914578 0.039619
C  2.514941 -1.703654 0.107865
C  3.301143 1.049798 0.134265
C  -0.844579 3.378681 0.126682
C  3.879763 -1.340667 0.257674
C  4.267623 0.020796 0.262944
H  -0.757708 -1.520516 1.580241
H  -2.365598 -1.572762 -1.053942
H  -3.090315 0.097807 1.393614
H  -2.95392 2.850985 0.329088
H  0.029548 -2.150268 -1.782544
H  1.327484 3.625586 0.095647
H  2.209763 -2.755034 0.101319
H  -1.30893 -3.652069 0.438107
H  3.610233 2.101003 0.149256
H  -1.035167 4.454409 0.212557
H  -4.099905 -2.228006 0.481875
H  -3.861132 0.440436 -1.338539
H  4.640439 -2.121053 0.371395
H  5.326281 0.281397 0.373071
