program: Gaussian 09
title: 000178759
version: EM64L-G09RevD.01
frameworkgroup: C1[X(C18H22N6O5)]
method: RPBEPBE
basis: SDD
operation: Freq
keyword: #p
keyword: freq=noraman
keyword: PBEPBE/SDD
title: #p freq=noraman PBEPBE/SDD
converged: YES YES NO NO
title: Mulliken charges:
elementType: O O O O O N N N N N N C C C C C C C C C C C C C C C C C C H H H H H H H H H H H H H H H H H H H H H H
charge: -0.244063 -0.441689 -0.495525 -0.450272 -0.506291 -0.190755 -0.160037 -0.367029 -0.169474 -0.179076 -0.051814 -0.046959 -0.154719 -0.169072 -0.081188 -0.174875 -0.473531 0.284716 -0.388545 0.203051 -0.349682 0.220057 -0.253537 -0.084198 0.151343 -0.410838 -0.201514 -0.483858 -0.327953 0.228722 0.277801 0.243645 0.245466 0.269555 0.241037 0.251746 0.235183 0.233331 0.169426 0.213460 0.371978 0.251034 0.248586 0.281530 0.375831 0.366006 0.201871 0.221446 0.416024 0.256072 0.397574
chargesum: 0.00000
title: Mulliken charges with hydrogens summed into heavy atoms:
elementType: O O O O O N N N N N N C C C C C C C C C C C C C C C C C C
charge: -0.244063 -0.065858 -0.129519 -0.034248 -0.108717 -0.190755 -0.160037 0.004949 -0.169474 -0.179076 -0.051814 0.181763 0.123082 0.074574 0.164278 0.094681 0.019252 0.284716 0.079970 0.203051 0.033204 0.220057 -0.002503 -0.084198 0.151343 -0.162252 0.080016 -0.060540 -0.071881
polarizability: 3.83026399e+02 1.55196606e+00 2.56441150e+02 1.31832230e+01 8.98512441e+00 1.45977339e+02
1716.lowfreq: -14.7781 -4.2554 -3.7080 -0.0006 0.0005 0.0009 17.4052 22.5383 43.2475
frequency: 14.3391 22.4990 43.2383 51.3057 60.9396 80.6143 100.0693 116.7691 133.6031 145.3076 159.7454 165.9589 168.4113 183.0899 189.1411 199.2324 211.4986 213.2735 233.6681 236.2955 263.7558 273.7255 297.0301 299.4477 320.3165 344.7302 374.0467 400.2423 420.8091 456.0043 488.8553 509.8412 518.5237 536.0647 539.9196 556.0469 566.6736 577.4064 609.0972 617.4201 635.9066 647.9703 652.3895 662.5053 681.4943 711.6973 714.1791 722.3012 748.2606 762.6274 784.8292 795.5080 800.9456 816.0855 824.2787 832.4829 858.6397 865.3253 880.3291 898.7531 909.0657 934.5985 937.1480 951.4939 955.6453 959.3951 965.4135 986.6589 992.8287 1010.5295 1025.1922 1035.6114 1045.8334 1050.5531 1059.0250 1062.9723 1066.6800 1083.3581 1102.8275 1141.3480 1143.7943 1151.4260 1163.7062 1175.4512 1179.1325 1195.7158 1205.8831 1209.1395 1223.2599 1228.1296 1244.8673 1253.2254 1255.2641 1259.3451 1267.6873 1276.1412 1288.0942 1291.4635 1292.1534 1297.9481 1320.9711 1326.4652 1334.9676 1341.9049 1349.0454 1355.0629 1371.5066 1381.3010 1381.7443 1389.3027 1397.4585 1402.7029 1439.7349 1443.6451 1455.7017 1456.4763 1472.5390 1475.3608 1483.8013 1496.8728 1520.3203 1523.1283 1573.5244 1579.5379 1656.3410 2874.5108 2920.0310 2957.8816 2971.3327 2988.4218 2994.2927 3002.0085 3012.1695 3022.5569 3030.8287 3034.2295 3053.4592 3066.8456 3074.3694 3108.1208 3163.0564 3197.5400 3202.3602 3239.3709 3243.2698 3465.0898 3613.4325
redmass: 5.8336 5.8698 5.1058 5.4031 5.2176 5.2308 5.2793 6.0963 2.8142 4.8764 6.2067 2.9632 3.7486 6.7123 2.8517 1.6166 6.0697 3.6877 4.8544 5.1889 4.1023 5.2413 4.7887 5.0078 6.1617 6.9004 5.8974 4.7843 5.0952 4.9827 3.4288 5.4270 2.4028 2.7934 1.6381 3.8041 4.3641 4.6631 3.9009 3.8055 4.3141 5.3834 6.7677 6.7869 2.5806 2.9004 1.6407 4.1982 2.0922 2.9503 3.6241 3.9727 3.4658 2.7126 2.2758 1.3959 3.2927 1.8042 6.4456 4.5128 1.2126 1.4354 2.6105 2.7084 2.2784 2.3711 2.6194 2.5340 3.1468 1.8966 2.1050 5.2756 3.1379 3.1138 2.8338 1.6581 4.0137 2.3564 5.5358 1.8083 1.3189 3.4055 1.2908 2.3411 1.5412 1.3900 1.8324 1.3849 1.3679 1.3520 1.3892 1.3308 1.3178 2.0319 1.2199 1.4059 1.5633 1.7424 3.2764 1.3910 1.4345 2.3303 3.4575 2.0683 1.3429 1.7548 1.2284 1.8882 1.3247 1.7581 1.7891 3.7994 4.1151 5.1811 2.4060 1.0849 1.1278 1.1476 4.3072 1.2525 3.1010 1.3211 3.9697 8.2343 1.6089 1.0673 1.0723 1.0655 1.0836 1.0864 1.0634 1.0853 1.0868 1.0893 1.0628 1.1012 1.0899 1.1001 1.0874 1.1053 1.0925 1.0700 1.0926 1.1038 1.0990 1.0644 1.0670
irintensity: 0.2703 1.5215 3.5315 2.2941 0.2660 4.6792 1.4378 1.1682 22.7190 5.1912 4.9709 1.3442 12.4721 12.6259 36.6048 124.8458 1.2144 9.2141 3.0864 11.5636 2.2461 1.7936 10.7742 5.3544 1.0149 21.5176 10.6954 0.6376 25.0091 6.8832 1.9730 15.6324 41.1742 57.6160 40.8624 11.3097 3.3531 5.8743 17.1297 0.5623 31.3297 19.4198 3.9368 18.5735 67.1047 11.3295 95.5923 78.5680 137.0291 107.1086 18.8342 48.3142 18.7373 40.1675 22.9054 14.1607 20.0068 15.3969 37.9602 59.7661 109.8413 5.8316 4.4314 6.6270 4.5095 10.1099 32.0353 59.5890 51.8241 44.8330 14.7471 94.9322 14.0957 82.1667 92.9252 7.6859 27.3567 9.3490 32.9625 1.5898 43.3047 1.7312 0.6566 58.7361 3.4870 27.5301 103.5580 22.5712 17.3324 15.7690 16.4177 8.4306 16.1546 19.5313 29.6722 8.7308 19.7908 44.1096 16.7169 10.2893 15.8236 24.6029 21.7926 120.8152 4.1398 163.0783 19.6001 16.3491 44.1040 11.9027 8.7794 3.3129 89.8871 21.0666 23.1682 3.2229 3.3722 5.0977 0.4390 6.0237 45.7269 98.2195 465.5828 19.1309 524.3842 1092.2013 840.5539 129.2545 53.0851 304.8666 77.7716 30.0992 29.0376 8.1763 14.8466 36.2311 48.7930 25.3334 19.1138 22.5658 11.9992 715.6426 3.6963 3.2881 2.8385 62.9299 24.6254
temp: 298.150 k
press: 1.00000 atm
elementType: 8 8 8 8 8 7 7 7 7 7 7 6 6 6 6 6 6 6 6 6 6 6 6 6 6 6 6 6 6 1 1 1 1 1 1 1 1 1 1 1 1 1 1 1 1 1 1 1 1 1 1
symmnumber: 1
zpe: 1052941.5 jmol-1
zpe.correction: 0.401044 hartree
zpe.thermalcorrener: 0.426056 hartree
zpe.thermalcorrenthalpy: 0.427000 hartree
zpe.thermalcorrgfe: 0.345354 hartree
zpe.sumelectzpe: -1401.563695 hartree
zpe.sumelectthermal: -1401.538683 hartree
zpe.sumelectthermalent: -1401.537739 hartree
zpe.sumelectthermalfe: -1401.619385 hartree
dipole: -2.2030 -0.6229 0.3934
dipole: 2.3229
quadrupole: -116.7006 -176.4045 -177.6849
quadrupole: 21.3009 -1.9620 15.9625
quadrupole: 40.2294 -19.4745 -20.7549 21.3009 -1.9620 15.9625
hfenergy: -1401.9647388 hartree
pointgroup: C01 [X(C18H22N6O5)]
dipole: 0.8549255 -0.3007604 -0.117861 debye
polarizability: 381.6382896|-7.5694429|255.7280275|19.0464389|-15.5329961|148.0785697 unknown
InChI: InChI=1S/C18H22N6O5/c25-5-9-1-3-23-4-2-10(13(9)23)22-16-12-17(20-7-19-16)24(8-21-12)18-15(28)14(27)11(6-26)29-18/h1,3,7-8,10-11,14-15,18,22,25-28H,2,4-6H2
charge 0 multiplicity 1
51 atoms
O  4.11498 -0.071846 1.360441
O  4.547173 -2.511316 -1.331282
O  6.48101 -1.717216 0.256792
O  4.154862 2.677432 0.818895
O  -2.793472 -2.182486 -0.152804
N  -5.7460 0.866672 -0.305977
N  2.132065 -0.953594 0.334604
N  -2.231322 0.467048 -0.55341
N  -0.037956 -1.605557 -0.001647
N  1.773689 1.540782 0.252835
N  -0.583309 2.13111 -0.107473
C  3.581695 -1.144584 0.539963
C  4.41734 -1.179279 -0.784741
C  5.768181 -0.565013 -0.326008
C  5.337381 0.496432 0.69906
C  -3.403459 1.278255 -0.182618
C  -4.046091 2.182952 -1.296335
C  -4.542588 0.338884 0.139831
C  -5.579039 2.172483 -0.983783
C  -4.761743 -0.965603 0.614303
C  5.014243 1.85576 0.010597
C  1.391831 0.229174 0.152744
C  -6.770586 -0.052871 -0.097636
C  0.057128 -0.200136 -0.076097
C  -0.948512 0.807016 -0.260144
C  -6.181394 -1.199302 0.468778
C  1.219604 -2.012742 0.239497
C  -3.688288 -1.941144 1.022237
C  0.725263 2.414369 0.132085
H  3.700581 -2.115358 1.059857
H  3.938751 -0.559546 -1.559768
H  6.347225 -0.133696 -1.165404
H  6.061174 0.647514 1.518971
H  -3.114695 1.919347 0.674658
H  -3.857938 1.712812 -2.277254
H  -3.61915 3.198439 -1.304255
H  -5.866666 3.002028 -0.309836
H  -6.20083 2.227531 -1.893686
H  4.567598 1.666777 -0.994764
H  5.96233 2.407129 -0.139265
H  -2.43929 -0.561397 -0.653855
H  -7.804712 0.154471 -0.362729
H  -6.709389 -2.115809 0.731403
H  1.532743 -3.048258 0.345926
H  5.315956 -2.93528 -0.857405
H  7.344103 -1.438238 0.646386
H  -3.081084 -1.552517 1.866486
H  -4.140217 -2.902704 1.328358
H  3.22341 2.248558 0.751476
H  0.977761 3.473215 0.243502
H  -1.824545 -2.321498 0.103487
