program: Gaussian 09
title: 000178713
version: EM64L-G09RevD.01
frameworkgroup: C1[X(C15H15ClN2O7S)]
method: RPBEPBE
basis: SDD
operation: Freq
keyword: #p
keyword: freq=noraman
keyword: PBEPBE/SDD
title: #p freq=noraman PBEPBE/SDD
converged: YES YES NO NO
title: Mulliken charges:
elementType: Cl S O O O O O O O N N C C C C C C C C C C C C C C C H H H H H H H H H H H H H H H
charge: -0.004993 0.937568 -0.260090 -0.346920 -0.541278 -0.513310 -0.231023 -0.235078 -0.247491 -0.416237 -0.709593 0.333771 0.096772 -0.047947 -0.339150 -0.276391 -0.471928 -0.122835 0.335813 0.240850 -0.418762 -0.270423 -0.160752 -0.201558 0.326802 -0.741326 0.330693 0.426424 0.274811 0.245575 0.244774 0.260626 0.330784 0.342453 0.256176 0.291072 0.254096 0.266555 0.257416 0.258887 0.245165
chargesum: 0.00000
title: Mulliken charges with hydrogens summed into heavy atoms:
elementType: Cl S O O O O O O O N N C C C C C C C C C C C C C C C
charge: -0.004993 0.937568 -0.260090 -0.346920 -0.541278 -0.513310 -0.231023 -0.235078 -0.247491 0.010187 -0.036357 0.333771 0.096772 -0.047947 -0.008457 -0.001580 0.018421 -0.122835 0.335813 0.240850 -0.158136 -0.014248 0.130320 0.319093 0.326802 0.020143
polarizability: 3.53061703e+02 -3.83623572e+00 2.52186065e+02 1.31581472e+01 3.10994943e+00 1.47277088e+02
1716.lowfreq: -5.3876 0.0017 0.0020 0.0025 0.6994 4.3393 21.8942 22.8655 27.2957
frequency: 21.8651 22.8370 27.2068 37.7124 47.2393 51.2974 57.6135 60.9496 65.9040 80.5914 96.5545 101.2964 121.0740 132.7638 135.6185 146.5922 149.9249 190.5665 202.5821 213.8804 229.3653 232.6243 245.6181 270.7492 281.9775 304.0072 308.5756 330.9922 352.0387 386.3063 411.0463 424.5929 445.7093 452.5700 467.6682 487.6661 519.8208 567.4642 591.8917 594.2018 609.8635 621.4467 627.1187 632.6485 676.1411 691.5036 710.1449 732.3421 753.5383 765.0969 776.8362 786.4706 796.4687 808.4925 822.3310 855.7011 869.7839 880.0018 889.4429 896.5708 907.4840 917.8940 948.1721 974.0195 976.3727 977.9405 1018.6680 1022.9123 1042.8681 1045.0236 1070.2948 1082.6776 1106.3505 1111.3909 1135.2261 1173.7218 1191.1005 1199.7217 1219.8605 1233.6593 1249.4511 1273.5045 1284.7280 1329.5658 1359.6636 1374.0169 1381.0196 1388.2592 1428.6108 1431.5907 1451.0017 1452.3112 1463.3386 1477.9523 1492.7650 1504.9076 1526.8109 1576.4109 1602.9748 1607.9297 1644.0198 1671.3841 2923.5853 2999.5003 3010.9909 3070.2834 3098.9512 3139.4567 3147.6792 3161.1405 3184.2571 3219.9186 3235.5251 3276.0995 3368.4998 3404.7115 3538.9632
redmass: 6.6101 6.5591 4.0376 5.0147 4.6733 3.9870 1.9760 4.9913 3.8395 6.4035 7.1346 5.5136 2.0190 3.5433 5.2832 8.3539 5.2109 8.2381 5.6598 6.0617 6.7269 6.1795 7.1311 3.4577 3.1118 4.3388 9.0567 3.7770 8.5135 7.5080 4.5411 4.9702 6.9104 3.4712 4.4061 5.5911 5.5216 3.6388 4.4603 3.7562 4.6089 5.1156 5.6724 7.3823 6.2934 4.8484 5.0962 1.6482 1.2220 4.1294 2.6799 2.2430 1.8266 13.9748 1.3056 1.9835 5.9396 1.3946 3.9996 8.7496 6.5185 4.7324 7.4904 1.3871 1.8741 2.3722 1.4792 4.3729 2.8107 1.6933 1.7300 3.9376 1.9094 1.9942 1.5527 3.7886 1.5012 4.2513 2.6335 1.3087 1.3928 1.1322 2.1902 1.6361 2.3586 1.2838 2.7082 1.2570 3.5147 1.1925 1.0509 1.0540 2.3426 1.1064 4.7298 5.0827 1.0885 3.0018 6.8590 7.5945 9.8505 8.9961 1.0670 1.0926 1.0371 1.0531 1.0967 1.0912 1.1014 1.1151 1.0912 1.0936 1.0992 1.1075 1.0412 1.0785 1.1005
irintensity: 0.3977 0.4948 1.9131 0.1289 4.6733 0.3258 1.1614 0.8850 0.7355 2.8203 0.6308 2.7315 22.0369 4.1797 0.0722 3.5562 2.1560 2.1622 0.3635 4.1147 0.7881 3.5651 5.0227 0.5442 9.7024 6.1390 2.3317 10.5287 41.1185 6.8044 56.4967 36.6299 64.2717 14.8551 156.4756 10.9993 4.1845 4.9435 1.5982 7.3848 9.1468 2.1318 4.0505 12.5857 9.0077 4.6461 24.0076 20.8545 92.2659 69.8465 15.9771 58.7890 107.7351 84.5681 18.3488 30.6545 14.8820 0.9649 33.1116 660.5607 118.1990 15.4494 161.7165 10.0562 27.1838 162.8005 27.2913 134.6903 0.5629 11.0426 7.0835 10.9842 56.7490 23.0181 22.9447 167.0465 75.7113 95.2182 3.7828 10.6023 32.1697 5.4506 38.6712 25.1730 6.5627 31.6351 130.4064 56.8115 5.8852 39.0638 22.7125 21.8793 43.1859 42.5567 15.0381 35.4926 36.9749 323.0880 10.1166 519.0161 275.3614 234.4517 36.1550 22.7215 0.4091 21.9543 4.9701 18.8751 9.2609 6.1179 2.3540 4.6278 0.6042 5.4905 29.7918 253.2913 24.1843
temp: 298.150 k
press: 1.00000 atm
elementType: 17 16 8 8 8 8 8 8 8 7 7 6 6 6 6 6 6 6 6 6 6 6 6 6 6 6 1 1 1 1 1 1 1 1 1 1 1 1 1 1 1
symmnumber: 1
zpe: 754712.3 jmol-1
zpe.correction: 0.287455 hartree
zpe.thermalcorrener: 0.314461 hartree
zpe.thermalcorrenthalpy: 0.315405 hartree
zpe.thermalcorrgfe: 0.226263 hartree
zpe.sumelectzpe: -2072.678143 hartree
zpe.sumelectthermal: -2072.651137 hartree
zpe.sumelectthermalent: -2072.650193 hartree
zpe.sumelectthermalfe: -2072.739335 hartree
dipole: -6.5806 3.2069 3.5258
dipole: 8.1253
quadrupole: -168.0940 -158.8645 -162.1438
quadrupole: 8.3151 17.7369 -7.4835
quadrupole: -5.0599 4.1696 0.8903 8.3151 17.7369 -7.4835
hfenergy: -2072.965598 hartree
pointgroup: C01 [X(C15H15Cl1N2O7S1)]
dipole: 2.8078593 -1.1503762 1.0058052 debye
polarizability: 348.8993769|8.641074|252.004722|-30.4229363|7.3997779|151.6207576 unknown
InChI: InChI=1S/C15H15ClN2O7S/c1-9(19)24-8-25-15(20)11-5-14(26(17,21)22)12(16)6-13(11)18-7-10-3-2-4-23-10/h2-6,18H,7-8,17H2,1H3
charge 0 multiplicity 1
41 atoms
Cl -3.941916 -2.972557 0.702566
S  -5.174606 0.186105 0.377309
O  3.471196 -1.176195 -0.206241
O  1.083873 1.514037 -0.780762
O  -5.243149 1.810318 0.291721
O  -6.097377 -0.751517 -0.573527
O  -0.756098 2.956745 -0.653193
O  2.492722 3.092725 0.329422
O  4.441474 1.831034 0.00086
N  0.73669 -1.070935 -0.435282
N  -5.494479 -0.223843 2.140834
C  -0.584345 -0.782589 -0.224051
C  -1.10581 0.570618 -0.306989
C  -3.360151 -0.262663 0.178198
C  -2.490956 0.792019 -0.10331
C  -1.504591 -1.840038 0.090714
C  1.338524 -2.404503 -0.2852
C  -2.860434 -1.578765 0.284094
C  2.795939 -2.339115 -0.638975
C  -0.314915 1.790257 -0.580598
C  3.684885 -3.165601 -1.30198
C  4.976444 -2.500714 -1.289039
C  4.809525 -1.296474 -0.630302
C  1.965283 2.666713 -0.967285
C  3.748209 2.567096 0.730547
C  4.074089 3.044294 2.123554
H  -2.882764 1.814347 -0.168302
H  1.364397 -0.272383 -0.602962
H  -1.148708 -2.867751 0.185012
H  0.850637 -3.142002 -0.95285
H  1.199674 -2.767173 0.757793
H  3.453883 -4.127119 -1.756713
H  -6.046382 -1.095639 2.186461
H  -5.966872 0.591691 2.565905
H  5.900904 -2.869759 -1.728333
H  5.439491 -0.442299 -0.400356
H  2.776647 2.317501 -1.622782
H  1.390212 3.52071 -1.351216
H  3.996855 4.143269 2.178273
H  3.340522 2.63155 2.838187
H  5.086379 2.720507 2.403594
