program: Gaussian 09
title: 000178723
version: EM64L-G09RevD.01
frameworkgroup: C1[X(C13H18O9S)]
method: RPBEPBE
basis: SDD
operation: Freq
keyword: #p
keyword: freq=noraman
keyword: PBEPBE/SDD
title: #p freq=noraman PBEPBE/SDD
converged: YES YES NO NO
title: Mulliken charges:
elementType: S O O O O O O O O O C C C C C C C C C C C C C H H H H H H H H H H H H H H H H H H
charge: 1.200587 -0.276376 -0.390448 -0.361215 -0.409088 -0.422669 -0.427174 -0.566855 -0.471626 -0.463910 -0.131038 -0.205903 -0.130671 -0.060925 0.070279 -0.358285 -0.394842 0.441003 -0.400710 -0.353346 -0.221205 -0.223373 -0.225107 0.207235 0.275670 0.312232 0.217877 0.200676 0.208891 0.237942 0.362390 0.338128 0.235206 0.213076 0.348696 0.235670 0.246365 0.435019 0.233540 0.238155 0.236127
chargesum: 0.00000
title: Mulliken charges with hydrogens summed into heavy atoms:
elementType: S O O O O O O O O O C C C C C C C C C C C C C
charge: 1.200587 -0.276376 -0.390448 -0.361215 -0.046698 -0.084541 -0.078478 -0.131836 -0.471626 -0.463910 0.076198 0.069767 0.181561 0.156952 0.270955 0.088548 0.053440 0.441003 -0.165040 -0.106982 0.012336 0.014782 0.011021
polarizability: 2.61674184e+02 -1.27912404e+01 2.03837731e+02 -7.49027532e+00 -1.63384562e+01 1.48085855e+02
1716.lowfreq: -5.2534 -3.5473 -0.0009 0.0009 0.0011 3.2752 10.9412 24.8099 33.3029
frequency: 10.4760 24.7835 33.2899 43.2952 53.4824 62.0000 76.4272 88.2740 98.9949 114.4000 129.1287 165.0675 174.8889 189.8494 201.4518 219.4292 234.6000 253.7304 271.2893 298.4208 306.0296 320.4258 332.6203 338.0225 356.7228 372.6641 377.5147 395.7650 403.1159 410.7151 427.6612 438.2241 469.5164 490.6680 508.6000 547.8407 573.5013 590.5861 599.9491 612.8978 616.8614 638.0693 704.1122 722.1016 759.4650 825.1937 846.9836 857.2024 866.5893 876.5620 917.6940 937.7729 960.6373 964.0919 967.1346 976.0535 985.1662 987.5850 991.6902 1004.5619 1005.2588 1020.7448 1025.0275 1028.2758 1047.8352 1068.7475 1092.4332 1094.2505 1099.4961 1115.4276 1176.5024 1181.4864 1183.5370 1186.5618 1193.6072 1200.9549 1229.7150 1237.9350 1256.1903 1275.7670 1304.8699 1313.3619 1321.5913 1330.2220 1330.7545 1336.8001 1344.7378 1361.9945 1370.2574 1378.6342 1381.2038 1387.5243 1388.1908 1442.4134 1459.9175 1478.9753 1488.1664 1595.4417 1616.3264 2806.4058 2907.9829 2913.8472 2928.3234 2979.0816 2986.6699 3005.6278 3068.9539 3085.5310 3102.7178 3125.7190 3129.4228 3140.4134 3154.9815 3170.1932 3525.6989 3536.3346 3555.9543
redmass: 4.6039 5.6204 6.0181 6.1852 6.5961 6.1432 5.4011 7.4393 4.7781 6.7790 8.3510 4.3513 7.3339 4.9142 6.0451 5.3484 4.5406 5.9851 6.4541 4.6544 5.1866 3.0543 1.3080 5.9591 5.8318 5.3424 4.2314 5.1417 2.7849 1.3828 1.2294 6.2680 3.8064 4.4403 4.4280 3.9801 4.5071 9.6321 3.9334 5.4837 6.2873 4.4888 1.8236 1.1513 1.8139 3.7877 2.9864 1.2929 11.8457 4.3450 6.7420 1.5058 5.4106 1.8005 7.8876 4.3292 1.4482 3.9955 5.6708 2.7638 2.1815 2.4137 4.3459 2.4336 2.8876 4.2784 3.1344 1.6611 3.2898 2.1468 1.0597 1.1636 1.3011 1.2274 1.1226 1.2868 2.3377 1.2580 1.2092 1.1638 1.2245 1.2574 1.2591 1.2702 1.2952 1.4507 1.2364 1.2148 1.1946 1.3262 1.3941 1.3273 7.9408 2.1717 1.0819 1.1201 2.3366 6.0137 6.0821 1.0719 1.0821 1.0826 1.0823 1.0685 1.0640 1.0842 1.0858 1.1005 1.0956 1.0874 1.0878 1.0915 1.0961 1.1015 1.0659 1.0655 1.0657
irintensity: 0.0351 0.6630 0.5805 0.2380 0.2000 3.0102 3.2242 5.2706 5.4036 1.7616 0.4416 0.7556 2.8298 3.7428 4.9895 2.1863 20.1839 5.2668 2.2283 2.9564 0.4688 4.7493 46.2586 8.7769 11.1466 46.7275 36.1036 6.6933 1.6791 207.6171 146.6391 5.0492 30.7773 32.6909 20.1685 25.8933 8.2729 67.1682 32.8035 32.4185 1.3958 33.1696 64.0021 140.7043 83.1134 13.1439 6.9412 0.3102 186.1406 80.1486 90.7355 2.7699 116.8279 10.8022 344.0189 56.9549 0.6135 19.8000 0.8979 49.4015 31.6023 21.6640 121.9446 15.1511 36.7795 1.4403 4.5493 3.5175 17.9498 10.4964 0.4319 2.3166 61.7568 4.3109 0.3160 29.5653 19.2950 2.3698 44.7759 15.1046 29.1389 25.6150 5.9796 2.7882 13.4103 7.7393 7.4710 76.5675 12.8446 26.1382 1.8610 28.5174 1.6909 9.7821 5.8168 4.8144 2.8898 1.8190 1.0529 920.0012 7.1294 43.6428 61.7080 45.3765 30.0417 6.9112 10.0672 11.3926 12.8811 4.0572 4.2218 12.1014 27.8001 17.5044 17.5999 18.3485 6.3817
temp: 298.150 k
press: 1.00000 atm
elementType: 16 8 8 8 8 8 8 8 8 8 6 6 6 6 6 6 6 6 6 6 6 6 6 1 1 1 1 1 1 1 1 1 1 1 1 1 1 1 1 1 1
symmnumber: 1
zpe: 804469.8 jmol-1
zpe.correction: 0.306406 hartree
zpe.thermalcorrener: 0.330364 hartree
zpe.thermalcorrenthalpy: 0.331308 hartree
zpe.thermalcorrgfe: 0.250389 hartree
zpe.sumelectzpe: -1579.236075 hartree
zpe.sumelectthermal: -1579.212117 hartree
zpe.sumelectthermalent: -1579.211173 hartree
zpe.sumelectthermalfe: -1579.292092 hartree
dipole: 0.3608 -6.3120 -2.3019
dipole: 6.7283
quadrupole: -121.7468 -175.7122 -141.2665
quadrupole: 11.5649 -8.0944 -5.1277
quadrupole: 24.4950 -29.4704 4.9753 11.5649 -8.0944 -5.1277
hfenergy: -1579.5424816 hartree
pointgroup: C01 [X(C13H18O9S1)]
dipole: -0.9378739 -2.3356569 -0.8199694 debye
polarizability: 240.8797845|-31.0368093|223.1043909|-15.853457|-12.5269951|149.6135943 unknown
InChI: InChI=1S/C13H18O9S/c14-6-9-10(15)11(16)12(22-23(17,18)19)13(21-9)20-7-8-4-2-1-3-5-8/h1-5,9-17H,6-7H2
charge 0 multiplicity 1
41 atoms
S  0.849912 3.089227 0.010983
O  0.720504 -1.865689 0.131806
O  1.655647 1.619293 -0.888841
O  -0.676834 0.001935 -0.104044
O  4.096167 0.574903 0.31852
O  4.465055 -2.293229 -0.176722
O  0.806454 -4.729081 -0.198045
O  -0.854439 2.650854 -0.277507
O  1.204414 2.97894 1.576023
O  1.191588 4.373947 -0.864225
C  3.096703 -0.248788 -0.341567
C  3.165083 -1.701997 0.19381
C  1.722434 0.397131 -0.079084
C  1.972743 -2.554424 -0.281168
C  0.585354 -0.555051 -0.519715
C  1.905904 -3.943051 0.36054
C  -1.878651 -0.75646 -0.624087
C  -3.123229 0.002454 -0.242079
C  -3.899806 -0.410058 0.869877
C  -3.522569 1.146154 -0.981819
C  -5.062601 0.304129 1.233871
C  -4.680996 1.863592 -0.615304
C  -5.454428 1.442257 0.491182
H  3.264882 -0.276486 -1.445399
H  3.193415 -1.674094 1.297003
H  1.633036 0.624651 1.003098
H  1.978733 -2.66038 -1.391714
H  0.602273 -0.696437 -1.627496
H  1.810377 -3.829596 1.460632
H  2.825843 -4.505235 0.136832
H  4.967818 0.103329 0.255579
H  4.4999 -2.420466 -1.161426
H  -1.84641 -1.759181 -0.168246
H  -1.756924 -0.839285 -1.722899
H  -0.035095 -4.236389 -0.018874
H  -3.590792 -1.28712 1.45135
H  -2.929262 1.479782 -1.841741
H  -0.904569 1.623831 -0.129441
H  -5.658176 -0.022387 2.093132
H  -4.975884 2.750197 -1.186101
H  -6.354476 1.998681 0.774907
