program: Gaussian 09
title: 000178701
version: EM64L-G09RevD.01
frameworkgroup: C1[X(C19H22O3)]
method: RPBEPBE
basis: SDD
operation: Freq
keyword: #pfreq=noraman
keyword: PBEPBE/SDD
title: #p freq=noraman PBEPBE/SDD
converged: YES YES NO NO
title: Mulliken charges:
elementType: O O O C C C C C C C C C C C C C C C C C C C H H H H H H H H H H H H H H H H H H H H H H
charge: -0.261038 -0.293527 -0.272550 -0.044213 -0.592307 -0.339434 0.528447 -0.712417 -0.554345 -0.459506 0.350781 -0.200417 -0.403002 -0.396509 0.384544 0.302773 -0.392525 -0.408890 -0.746541 -0.227512 -0.219261 -0.242939 0.222074 0.216234 0.206001 0.270239 0.225123 0.214056 0.213417 0.233085 0.301366 0.232172 0.222171 0.249138 0.250818 0.221026 0.237139 0.268388 0.251689 0.249653 0.244714 0.223136 0.223275 0.225475
chargesum: 0.00000
title: Mulliken charges with hydrogens summed into heavy atoms:
elementType: O O O C C C C C C C C C C C C C C C C C C C
charge: -0.261038 -0.293527 -0.272550 0.177861 -0.170073 0.155928 0.528447 -0.051859 -0.252979 -0.227334 0.350781 0.021754 -0.153864 0.075335 0.384544 0.302773 -0.155386 -0.140502 -0.000485 -0.004375 0.004014 -0.017464
polarizability: 2.85416821e+02 1.14315308e+01 2.37739534e+02 -6.25913790e+00 7.82218633e+00 1.18112854e+02
1716.lowfreq: -8.2744 -6.7851 -0.0009 -0.0007 -0.0005 4.5746 13.7588 20.3865 26.6539
frequency: 13.5051 20.2647 26.5987 38.2374 44.2886 51.2393 76.4112 82.0535 89.3766 105.1975 112.3982 156.4642 194.2523 206.3356 213.9651 238.7327 241.1960 274.0431 278.0435 308.7842 336.8290 376.9388 402.0295 402.3903 459.8080 463.4201 484.1177 524.9884 538.7153 557.2038 579.5660 601.8665 613.4353 620.7283 624.0252 701.0047 703.7103 739.6300 746.1356 776.6640 794.1989 818.0965 822.2757 857.5010 873.3565 890.3941 892.4904 911.1259 917.3147 930.3554 948.5627 958.4563 970.5564 980.3698 981.6683 989.5054 993.1517 997.7221 1002.5195 1013.7418 1027.8640 1042.6537 1049.8763 1081.8104 1083.8079 1128.5491 1137.6593 1170.5437 1170.7912 1171.4616 1178.7391 1184.8323 1205.8714 1218.9810 1223.6270 1245.2635 1253.8071 1281.6665 1311.6284 1317.7999 1325.3603 1333.1989 1354.5799 1362.6090 1383.8993 1387.8482 1390.1697 1396.9527 1433.5887 1442.7673 1453.1278 1455.3951 1462.9947 1465.2711 1471.5328 1473.2444 1484.8230 1486.1495 1490.9260 1595.1173 1599.5228 1608.9460 1619.5296 1635.1717 2944.2291 2971.2662 2981.3328 2988.5962 3006.9538 3016.7584 3020.7699 3043.5633 3073.2122 3087.4208 3093.1911 3100.3063 3113.1252 3119.9801 3124.7752 3138.7257 3141.4891 3142.4680 3156.8960 3163.5064 3168.0590 3173.9062
redmass: 3.9014 4.2991 5.8989 3.7131 1.8622 1.6790 4.9511 6.1043 3.6103 3.6947 3.2683 4.3689 2.0717 1.5042 2.8211 4.6685 4.5760 4.0637 3.4154 3.6517 2.6039 2.1759 2.8381 2.6549 3.0248 2.9560 3.7961 6.1892 3.5955 3.5590 3.1676 4.7660 6.4754 6.0893 5.0787 2.3493 2.1604 1.4581 3.5462 3.2711 1.9147 3.6157 2.6094 1.2491 1.7750 1.5012 1.4249 1.5209 2.3912 2.5164 2.3441 2.1832 1.3248 1.4384 4.6283 6.2267 1.3767 2.9699 2.1296 1.7391 2.1362 1.6552 1.7154 1.5785 1.5663 2.1497 1.8804 1.0759 1.0964 1.3996 1.6022 1.1161 3.2644 1.8601 1.2798 1.1506 2.8321 1.4555 1.3853 1.3837 1.4439 1.5905 1.2854 2.0024 1.2350 7.8324 1.2194 2.8208 2.6238 2.2448 1.0621 1.0540 1.0956 1.1521 1.0946 1.0668 2.0883 1.1519 2.0797 6.1619 6.7413 5.6662 6.0321 8.6795 1.0611 1.0782 1.0383 1.0612 1.0382 1.0993 1.0585 1.1020 1.0993 1.0998 1.1076 1.0943 1.0869 1.0871 1.0872 1.0933 1.1024 1.0927 1.0985 1.0912 1.0971 1.0963
irintensity: 0.4717 0.2076 0.3015 0.6308 1.0240 0.6394 0.5758 0.5530 3.0045 1.7853 3.4447 0.4015 3.7196 3.7866 1.4709 3.7340 0.2595 2.1930 7.7369 6.1546 0.8328 2.5305 0.2689 3.5077 8.8317 3.9696 3.2453 0.3889 1.4146 3.1576 4.1921 6.0248 2.1825 3.5453 0.7873 32.6859 13.0889 95.6646 4.9851 20.6955 33.1945 3.7764 3.1039 0.2516 15.2812 18.2014 2.9002 14.7408 18.6620 9.9459 11.4477 8.6703 0.7424 1.3206 13.3508 0.0212 0.9590 27.6627 125.6707 8.5013 8.1643 13.0076 13.6692 7.3830 5.9308 1.5829 19.0675 0.0647 5.7181 9.2737 113.0403 0.9235 259.6599 7.6240 4.1878 42.8152 148.2352 27.3774 5.8432 3.9768 3.1404 3.3083 1.0625 7.9295 47.4065 5.6969 28.5670 22.4741 64.2281 5.6123 29.9640 14.3367 7.1769 72.1450 2.2013 20.6635 1.0999 18.7461 32.9377 3.4904 25.6820 141.7759 5.5783 248.0490 20.8728 7.5432 33.3517 43.2089 2.4148 15.9345 34.2313 21.8383 37.4658 32.6177 12.5793 7.5130 7.1349 8.3948 1.5231 33.4974 7.8620 26.9892 37.0429 1.9075 15.3793 8.0912
temp: 298.150 k
press: 1.00000 atm
elementType: 8 8 8 6 6 6 6 6 6 6 6 6 6 6 6 6 6 6 6 6 6 6 1 1 1 1 1 1 1 1 1 1 1 1 1 1 1 1 1 1 1 1 1 1
symmnumber: 1
zpe: 950663.0 jmol-1
zpe.correction: 0.362088 hartree
zpe.thermalcorrener: 0.383983 hartree
zpe.thermalcorrenthalpy: 0.384927 hartree
zpe.thermalcorrgfe: 0.307010 hartree
zpe.sumelectzpe: -961.275380 hartree
zpe.sumelectthermal: -961.253485 hartree
zpe.sumelectthermalent: -961.252541 hartree
zpe.sumelectthermalfe: -961.330458 hartree
dipole: 3.1489 -2.0801 -0.0666
dipole: 3.7745
quadrupole: -119.1424 -116.7273 -133.4819
quadrupole: -0.3594 0.9122 3.2264
quadrupole: 3.9748 6.3898 -10.3647 -0.3594 0.9122 3.2264
hfenergy: -961.6374681 hartree
pointgroup: C01 [X(C19H22O3)]
dipole: 1.1525232 -0.9336234 -0.0728768 debye
polarizability: 286.310094|6.9739843|236.0949775|-13.1824738|7.3403343|118.8641377 unknown
InChI: InChI=1S/C19H22O3/c1-15(13-21-16(2)20)11-18-9-6-10-19(12-18)22-14-17-7-4-3-5-8-17/h3-10,12,15H,11,13-14H2,1-2H3
charge 0 multiplicity 1
44 atoms
O  2.915766 -2.520788 0.145223
O  -1.430036 1.599236 -0.034784
O  0.591651 -2.30184 -0.020261
C  4.000889 -0.284133 0.277335
C  3.363951 0.36917 -0.992444
C  3.050499 -1.276315 0.973644
C  2.277568 1.390683 -0.677527
C  5.362427 -0.93991 -0.051222
C  0.924759 0.983423 -0.549527
C  2.610628 2.752252 -0.468495
C  -0.074997 1.924537 -0.202939
C  1.603327 3.688652 -0.132252
C  0.260854 3.285195 0.004288
C  -1.813504 0.192539 -0.239059
C  -3.303127 0.044328 0.007418
C  1.648473 -2.934862 -0.259374
C  -3.841776 -1.259204 0.156774
C  -4.170177 1.161323 0.061916
C  1.736486 -4.254198 -0.996635
C  -5.228589 -1.443884 0.347758
C  -5.558192 0.975682 0.258815
C  -6.093299 -0.325098 0.39901
H  4.171683 0.52582 1.01826
H  2.970775 -0.436362 -1.642752
H  4.178879 0.861973 -1.555929
H  2.047593 -0.84833 1.141279
H  3.478755 -1.622279 1.930822
H  6.072514 -0.18789 -0.440426
H  5.812187 -1.402208 0.847228
H  5.244227 -1.731955 -0.811422
H  0.669307 -0.068114 -0.706817
H  3.651404 3.080937 -0.575498
H  1.865488 4.741531 0.022012
H  -0.530349 3.994201 0.266447
H  -1.233668 -0.464036 0.439315
H  -1.563232 -0.102321 -1.280949
H  -3.173768 -2.129651 0.126706
H  -3.74797 2.164783 -0.040332
H  1.763501 -5.081086 -0.2635
H  2.65801 -4.308588 -1.596973
H  0.849779 -4.383673 -1.634803
H  -5.632825 -2.456174 0.462353
H  -6.221038 1.847587 0.302786
H  -7.169435 -0.466757 0.550432
