program: Gaussian 09
title: 000178685
version: EM64L-G09RevD.01
frameworkgroup: C1[X(C18H14N2S4)]
method: RPBEPBE
basis: SDD
operation: Freq
keyword: #p
keyword: freq=noraman
keyword: PBEPBE/SDD
title: #p freq=noraman PBEPBE/SDD
converged: YES YES NO NO
title: Mulliken charges:
elementType: S S S S N N C C C C C C C C C C C C C C C C C C H H H H H H H H H H H H H H
charge: 0.364206 0.364241 0.103655 0.103654 -0.249109 -0.249141 0.750958 -0.797993 0.451370 0.451412 -0.568367 -0.568390 -0.328531 -0.328556 -0.326562 -0.326545 0.451736 0.451734 -0.363937 -0.364005 -0.376321 -0.376236 -0.807669 -0.807669 0.245036 0.245039 0.261735 0.261735 0.233000 0.233004 0.235310 0.235306 0.226065 0.226755 0.245131 0.226066 0.226753 0.245128
chargesum: 0.00000
title: Mulliken charges with hydrogens summed into heavy atoms:
elementType: S S S S N N C C C C C C C C C C C C C C C C C C
charge: 0.364206 0.364241 0.103655 0.103654 -0.249109 -0.249141 0.750958 -0.797993 0.451370 0.451412 -0.568367 -0.568390 -0.083496 -0.083517 -0.064827 -0.064809 0.451736 0.451734 -0.130937 -0.131001 -0.141011 -0.140929 -0.109718 -0.109722
polarizability: 3.28473315e+02 4.57325951e-02 3.34093072e+02 -6.36651234e-03 -5.50856817e+00 1.70624685e+02
1716.lowfreq: -5.3357 -2.5944 0.0017 0.0024 0.0024 7.2832 8.4777 34.0755 37.0334
frequency: 8.4101 34.0070 37.0308 41.5152 42.3819 48.6866 49.9558 69.7765 79.4893 113.3923 136.4596 160.2438 160.3604 171.6088 183.9998 189.6312 280.9095 289.0071 307.1208 313.4622 318.3023 330.1453 354.9722 385.0850 399.7763 401.4144 406.0884 411.6144 413.8571 497.0197 497.1212 524.0895 541.5990 548.4421 554.6557 612.4697 639.7114 640.3963 648.5045 681.9224 713.7842 722.0622 740.2753 742.7083 804.1194 806.2226 827.3869 833.0163 837.6282 847.0569 946.3616 951.9734 962.4449 971.4452 976.6732 985.8818 987.8220 988.5050 1009.4001 1015.9991 1027.8807 1046.2964 1047.4222 1063.9322 1119.9900 1120.8139 1183.0562 1187.3378 1209.3972 1220.1503 1221.2105 1248.1762 1250.3827 1293.7664 1303.2344 1303.3995 1370.5203 1371.7910 1396.6917 1397.7455 1404.9608 1405.9748 1411.4457 1470.7512 1471.1559 1473.1910 1474.6005 1502.6051 1503.9292 1541.3340 1590.6253 1590.8109 1618.8427 1620.0012 2978.5930 2978.7550 3060.0308 3060.5047 3088.7603 3088.8286 3129.7592 3130.3084 3131.7549 3132.3393 3157.3251 3158.3858 3162.1204 3162.8659
redmass: 6.0534 1.0204 1.0649 19.0508 3.8141 3.5228 5.7429 3.6967 6.9705 23.1102 6.7812 6.4718 4.8881 6.1483 7.8688 10.8597 10.3588 12.9095 3.4239 16.3682 3.9406 4.1666 5.5578 11.1797 5.1608 11.7867 4.5286 3.2929 2.9123 3.5087 3.1540 10.3887 5.7679 7.2103 9.8750 9.8292 7.0620 6.2229 7.4606 4.5118 6.7532 3.1617 6.6042 3.4371 4.8836 4.7778 1.6400 1.6891 1.2494 1.2466 3.3489 1.3273 1.8443 1.3855 1.3808 7.0884 1.4000 1.4694 3.5232 2.8923 9.1745 1.5775 1.5755 4.1181 1.2778 1.2785 1.1934 1.1247 4.3741 2.9372 2.7908 10.3154 8.7956 6.5075 1.3037 1.2805 5.9262 5.6593 1.2228 1.2207 4.5131 3.1870 5.5142 1.0924 1.0974 1.0553 1.0579 2.7638 2.7612 11.9818 6.6899 6.6905 6.4707 6.4638 1.0385 1.0386 1.0951 1.0950 1.1000 1.1000 1.0889 1.0890 1.0889 1.0890 1.0963 1.0960 1.0972 1.0972
irintensity: 0.0043 1.0053 0.0274 1.1804 0.0729 0.0782 0.8910 0.2946 0.0044 0.0162 0.4667 0.2967 0.3367 0.9926 0.9068 1.7762 5.5625 0.4286 0.2782 0.4171 0.8549 2.1370 0.2582 1.5141 6.2852 8.2801 0.0202 0.0341 0.2348 73.1734 1.5276 12.1743 5.7855 6.7594 0.0010 1.8352 0.0236 4.1925 1.5240 21.9146 0.7152 16.7059 59.9223 30.5874 0.4208 6.9552 63.9936 0.2252 0.0969 1.5065 28.2356 0.4366 10.5624 0.9895 0.0873 46.8974 0.0509 3.7789 10.8373 6.0320 7.7318 30.9752 6.1769 10.9908 0.0881 19.7481 15.8929 2.6374 286.8547 17.6754 8.7619 4.1070 289.0456 51.1620 1.2559 1.6508 0.0061 1.6825 2.9244 28.6284 28.6192 0.0123 45.2285 1.1272 28.5786 21.9583 0.5546 11.3010 109.5934 13.0219 0.1417 1.9750 1.0001 4.8977 8.2218 46.4953 22.6516 8.9769 1.0078 30.3251 0.0539 18.6872 6.0172 26.8449 0.1124 16.2304 0.5646 0.2608
temp: 298.150 k
press: 1.00000 atm
elementType: 16 16 16 16 7 7 6 6 6 6 6 6 6 6 6 6 6 6 6 6 6 6 6 6 1 1 1 1 1 1 1 1 1 1 1 1 1 1
symmnumber: 1
zpe: 712251.5 jmol-1
zpe.correction: 0.271282 hartree
zpe.thermalcorrener: 0.294352 hartree
zpe.thermalcorrenthalpy: 0.295296 hartree
zpe.thermalcorrgfe: 0.214637 hartree
zpe.sumelectzpe: -2394.385313 hartree
zpe.sumelectthermal: -2394.362243 hartree
zpe.sumelectthermalent: -2394.361299 hartree
zpe.sumelectthermalfe: -2394.441958 hartree
dipole: -6.9951 0.0040 -0.0010
dipole: 6.9951
quadrupole: -152.1033 -197.4915 -158.5062
quadrupole: -0.0335 -0.0052 -5.9570
quadrupole: 17.2637 -28.1245 10.8608 -0.0335 -0.0052 -5.9570
hfenergy: -2394.6565949 hartree
pointgroup: C01[X(C18H14N2S4)]
dipole: 2.7520724 -0.0078792 -0.0004833 debye
polarizability: 328.4735523|0.0575126|333.6108566|0.0283811|10.4354963|171.1066639 unknown
InChI: InChI=1S/C18H14N2S4/c1-11-3-7-13(8-4-11)19-15-16(23-17(19)21)24-18(22)20(15)14-9-5-12(2)6-10-14/h3-10H,1-2H3
charge 0 multiplicity 1
38 atoms
S  -4.065203 1.668567 -0.02467
S  -4.07566 -1.642971 0.024714
S  -2.011534 4.015585 -0.074128
S  -2.037031 -4.002949 0.074169
N  -1.422317 1.290351 -0.011743
N  -1.430454 -1.281472 0.012342
C  -2.012596 0.006294 0.00024
C  -3.389799 0.010651 0.000104
C  0.00478 1.579505 0.033845
C  -0.005175 -1.579533 -0.033481
C  -2.339816 2.3648 -0.035015
C  -2.35475 -2.350077 0.035733
C  0.780462 1.505542 -1.140497
C  0.771353 -1.509386 1.140535
C  0.578707 2.004111 1.250401
C  0.565881 -2.007947 -1.25006
C  2.755812 2.258759 0.126972
C  2.74194 -2.274308 -0.127303
C  2.150538 1.835685 -1.084786
C  2.139522 -1.847286 1.084484
C  1.947594 2.336647 1.291377
C  1.932855 -2.348195 -1.29137
C  4.221066 2.653472 0.167735
C  4.204976 -2.677111 -0.168489
H  0.316872 1.201093 -2.084377
H  0.309853 -1.201723 2.084395
H  -0.045344 2.086972 2.145823
H  -0.058947 -2.087598 -2.145231
H  2.755952 1.769987 -1.996242
H  2.745647 -1.784497 1.995671
H  2.393231 2.668749 2.236289
H  2.376286 -2.683217 -2.236293
H  4.653285 2.509877 1.173259
H  4.820055 2.06778 -0.551541
H  4.347688 3.72187 -0.094203
H  4.637791 -2.535527 -1.174048
H  4.807332 -2.095006 0.550885
H  4.32575 -3.746296 0.093004
