program: Gaussian 09
title: 000178677
version: EM64L-G09RevD.01
frameworkgroup: C1[X(C18H14N2S4)]
method: RPBEPBE
basis: SDD
operation: Freq
keyword: #p
keyword: freq=noraman
keyword: PBEPBE/SDD
title: #p freq=noraman PBEPBE/SDD
converged: NO YES NO NO
title: Mulliken charges:
elementType: S S S S N N C C C C C C C C C C C C C C C C C C H H H H H H H H H H H H H H
charge: 0.380987 0.345896 0.313520 0.097971 -0.196419 0.047637 0.380497 0.223023 -0.603724 -0.571116 -0.321678 -0.320816 0.447837 -0.364756 -0.363427 -0.485801 0.286381 -0.803299 0.440946 -0.368178 -0.368954 -0.364712 -0.362153 -0.806045 0.255639 0.255735 0.237459 0.237410 0.228708 0.228638 0.243889 0.247539 0.247573 0.232655 0.232625 0.225804 0.225717 0.236990
chargesum: 0.00000
title: Mulliken charges with hydrogens summed into heavy atoms:
elementType: S S S S N N C C C C C C C C C C C C C C C C C C
charge: 0.380987 0.345896 0.313520 0.097971 -0.196419 0.047637 0.380497 0.223023 -0.603724 -0.571116 -0.066039 -0.065081 0.447837 -0.127297 -0.126016 -0.485801 0.286381 -0.102064 0.440946 -0.120639 -0.121381 -0.132057 -0.129528 -0.117533
polarizability: 4.73987879e+02 -5.76590233e+00 2.47938084e+02 -7.24301337e-02 8.95233633e-01 1.85578738e+02
1716.lowfreq: -40.2286 -19.8101 -4.4566 -4.1581 0.0014 0.0016 0.0018 6.6550 16.7942
frequency: -40.2243 -19.4681 16.7778 20.7539 23.7121 27.4043 37.8327 40.5265 70.6077 95.3434 114.4900 128.3278 140.3971 160.9961 198.1014 216.1125 265.3191 285.5778 306.6319 311.6460 313.0562 340.6881 369.3372 391.8173 400.9401 402.0388 403.6756 408.7995 421.2380 451.5254 492.6383 499.6973 503.0438 506.1444 536.8852 542.6824 579.3179 637.3386 642.4276 646.2157 693.5085 710.6235 726.3046 729.1173 750.4938 805.6975 816.7765 819.6835 827.0648 831.3759 833.7348 841.7117 943.7868 955.4060 964.8989 974.3137 981.8127 986.9947 987.1904 1003.8988 1007.8455 1029.4460 1047.1828 1048.2280 1117.5276 1118.0718 1172.7568 1180.3853 1191.8217 1209.8232 1220.2357 1221.8461 1283.0989 1300.3086 1300.4418 1319.9920 1354.6988 1369.8836 1396.9703 1399.0167 1404.2256 1407.9107 1469.7833 1471.2506 1473.4484 1473.5030 1491.9877 1502.8812 1544.9810 1572.1403 1588.5523 1617.3598 1619.0057 1684.5385 2974.6023 2978.7377 3055.6432 3060.9716 3085.2881 3089.8545 3124.1097 3126.3018 3132.6990 3134.6112 3155.9725 3160.3803 3160.6774 3164.9623
redmass: 4.1509 3.9893 1.0428 5.7827 1.4153 2.2061 8.7916 5.6121 7.3803 17.5806 5.5669 4.5340 11.4534 7.0048 10.5226 9.3423 8.9999 8.3808 3.2214 5.7968 3.2976 8.3445 10.1619 23.6419 5.1028 4.7215 3.0216 2.9206 18.5231 5.3228 3.2842 11.8071 6.5405 8.8442 3.9438 6.8874 10.5263 7.0139 7.3176 5.4031 6.4459 3.6347 3.2120 4.7314 5.8317 5.1540 5.7058 3.0540 2.5414 1.6976 1.2455 1.2473 1.3060 1.3315 1.3668 1.3837 12.3310 1.4019 1.3992 4.7686 2.8832 3.5876 1.5460 1.5788 1.2744 1.2868 2.0618 1.2655 1.8108 2.7585 2.8176 3.2360 11.5488 1.2793 1.2988 8.3476 4.9855 5.5494 1.2187 1.2225 3.3007 3.4184 1.0952 1.0949 1.0531 1.0544 2.6466 2.7913 11.9502 6.0976 6.6320 6.4025 6.4816 12.7369 1.0389 1.0387 1.0948 1.0948 1.0998 1.1000 1.0890 1.0888 1.0892 1.0892 1.0952 1.0965 1.0961 1.0973
irintensity: 0.0300 0.0210 0.6446 0.0083 0.5671 0.7298 1.0733 0.1072 0.0702 0.0023 0.4330 0.7290 0.2647 0.7403 2.8779 0.7222 3.2166 7.5414 0.0586 3.0517 0.0438 9.0357 0.9111 45.0667 1.4745 2.8944 0.0370 0.2801 19.3751 7.3250 39.6951 3.0468 5.8160 1.5485 36.6850 12.9384 0.0188 0.1105 0.0938 19.4422 21.1711 4.1023 8.3219 6.8550 39.5527 0.5361 34.1225 31.0201 112.3322 7.5229 0.0961 0.0111 4.2749 0.5159 0.0349 0.0092 5.5077 0.1999 0.0800 6.4707 9.7692 44.3759 27.0067 18.2844 11.3702 15.2329 21.7603 3.1045 29.5982 25.5171 5.8925 2.8749 351.5567 0.0879 0.0185 67.5351 0.2715 1.1212 14.9533 7.2823 3.4420 0.1712 13.6280 12.2556 11.6161 13.3384 99.3637 73.0516 6.3866 2.5383 0.9727 42.7872 3.3303 1148.2772 49.2996 28.4489 21.2566 17.6558 17.6648 16.0214 12.5009 29.5636 10.2469 19.7682 15.9847 0.5748 8.5457 0.1751
temp: 298.150 k
press: 1.00000 atm
elementType: 16 16 16 16 7 7 6 6 6 6 6 6 6 6 6 6 6 6 6 6 6 6 6 6 1 1 1 1 1 1 1 1 1 1 1 1 1 1
symmnumber: 1
zpe: 706696.4 jmol-1
zpe.correction: 0.269166 hartree
zpe.thermalcorrener: 0.291175 hartree
zpe.thermalcorrenthalpy: 0.292119 hartree
zpe.thermalcorrgfe: 0.213327 hartree
zpe.sumelectzpe: -2394.367829 hartree
zpe.sumelectthermal: -2394.345821 hartree
zpe.sumelectthermalent: -2394.344877 hartree
zpe.sumelectthermalfe: -2394.423669 hartree
dipole: 1.4391 -3.7678 0.0068
dipole: 4.0332
quadrupole: -143.1601 -178.8700 -158.2778
quadrupole: 26.3742 -0.0482 0.3005
quadrupole: 16.9425 -18.7674 1.8249 26.3742 -0.0482 0.3005
hfenergy: -2394.6369959 hartree
pointgroup: C01 [X(C18H14N2S4)]
dipole: 0.500355 -1.505838 0.0041757 debye
polarizability: 473.0420784|-15.6880545|248.8847247|0.2854197|0.8402481|185.5778975 unknown
InChI: InChI=1S/C18H14N2S4/c1-11-3-7-13(8-4-11)19-17-22-15-16(23-17)24-18(21)20(15)14-9-5-12(2)6-10-14/h3-10H,1-2H3
charge 0 multiplicity 1
38 atoms
S  -0.42381 -0.730873 0.005075
S  -1.103262 3.585761 -0.016562
S  1.563561 1.717803 -0.003968
S  -4.237281 3.418722 -0.016246
N  -2.440114 1.296217 -0.007088
N  2.288284 -1.036888 0.005364
C  -3.488035 0.28541 -0.005001
C  -1.073798 0.958236 -0.004908
C  -0.207115 2.01734 -0.008341
C  -2.730132 2.670006 -0.013048
C  -3.976143 -0.209564 1.222913
C  -3.990637 -0.199762 -1.231113
C  -5.501843 -1.710077 -0.001134
C  -4.97632 -1.204337 1.216917
C  -4.990731 -1.19438 -1.221296
C  1.344139 -0.181114 0.003235
C  3.689081 -0.777361 0.004897
C  -6.604236 -2.753553 0.00098
C  6.51467 -0.353569 0.005194
C  4.388418 -0.628529 1.230203
C  4.402762 -0.723461 -1.219887
C  5.782976 -0.416465 1.219575
C  5.796862 -0.509351 -1.209319
C  8.0208 -0.157998 0.00613
H  -3.582035 0.186396 2.164412
H  -3.607518 0.203714 -2.173928
H  -5.356099 -1.590911 2.169768
H  -5.381842 -1.57328 -2.172658
H  -6.55445 -3.399648 -0.892756
H  -6.551987 -3.398734 0.895181
H  -7.600863 -2.270843 0.001976
H  3.837846 -0.683199 2.175044
H  3.862858 -0.850907 -2.163801
H  6.311031 -0.297162 2.17347
H  6.335939 -0.462586 -2.163392
H  8.361016 0.372819 -0.900541
H  8.353553 0.42102 0.88558
H  8.549654 -1.130893 0.034372
