program: Gaussian 09
title: 000178678
version: EM64L-G09RevD.01
frameworkgroup: C1[X(C17H12N2OS3)]
method: RPBEPBE
basis: SDD
operation: Freq
keyword: #p
keyword: freq=noraman
keyword: PBEPBE/SDD
title: #p freq=noraman PBEPBE/SDD
converged: YES YES NO NO
title: Mulliken charges:
elementType: S S S O N N C C C C C C C C C C C C C C C C C H H H H H H H H H H H H
charge: 0.340909 0.268358 0.120728 -0.189262 -0.220669 0.087411 0.686779 0.460805 -0.725309 -0.584526 -0.237704 -0.343119 -0.341910 0.131523 0.311356 -0.214928 -0.207015 -0.336583 -0.381246 -0.235978 -0.792149 -0.240098 -0.236446 0.251400 0.275999 0.233926 0.235142 0.243619 0.236207 0.234875 0.236395 0.251590 0.217722 0.231652 0.230544
chargesum: 0.00000
title: Mulliken charges with hydrogens summed into heavy atoms:
elementType: S S S O N N C C C C C C C C C C C C C C C C C
charge: 0.340909 0.268358 0.120728 -0.189262 -0.220669 0.087411 0.686779 0.460805 -0.725309 -0.584526 -0.237704 -0.091719 -0.065911 0.131523 0.311356 0.018999 0.028127 -0.092964 -0.145039 -0.001104 -0.086442 -0.008446 -0.005901
polarizability: 4.34288690e+02 1.06543049e+01 2.75434278e+02 -9.69641144e+00 -1.24466443e+01 1.28434345e+02
1716.lowfreq: -5.8985 -2.3743 -0.0005 0.0008 0.0021 0.9206 12.3215 26.5131 39.0845
frequency: 12.1596 26.4834 39.0794 44.7081 56.7540 69.1440 93.2654 96.4262 113.8121 149.2534 170.8734 190.3407 202.5750 219.0497 228.2333 261.4366 297.8943 318.9772 326.1995 370.4958 388.8110 394.8218 405.7354 444.9144 449.9643 481.7812 497.6271 526.1193 526.7934 533.8970 549.9638 586.8778 592.8610 598.0777 617.0234 639.2316 684.9344 702.5910 720.8169 745.4269 764.9059 768.5104 779.5262 835.0849 838.8280 863.8260 899.5141 919.6616 941.8851 956.9700 971.5068 983.7000 986.4172 990.3726 996.3972 1003.9872 1019.3200 1046.4725 1047.8648 1053.0098 1086.5347 1117.6861 1175.4638 1175.7074 1188.6230 1202.6123 1227.1824 1234.9884 1265.0202 1283.7595 1322.7999 1370.3962 1373.1308 1388.6278 1400.4609 1427.4369 1445.5676 1457.0503 1476.0660 1482.4422 1483.4762 1579.0528 1593.2165 1600.5287 1604.4189 1610.2972 1741.8280 2984.3522 3064.1241 3093.8774 3125.7949 3131.5014 3136.4224 3146.0256 3147.4162 3159.6177 3165.8118 3170.9802 3181.8153
redmass: 4.1267 8.3718 6.1803 4.4892 7.2109 6.2941 2.4153 1.6396 6.2023 6.4656 4.7927 8.2250 5.5141 8.4133 5.5991 6.7602 9.0442 6.0039 12.2514 9.5155 10.9011 4.3886 2.8254 3.3947 6.8872 4.4074 8.1763 8.2543 9.2681 7.0705 4.4168 8.1601 9.6668 9.0374 6.8980 8.6150 4.4889 2.0472 2.4306 5.8611 1.5031 2.7405 3.3639 3.1099 1.5612 1.3184 8.7272 1.4316 1.3772 10.3142 1.3931 1.3285 1.6204 6.1237 1.3312 12.3404 3.3353 1.9551 1.6539 3.1433 1.5693 1.8107 1.0511 1.0637 1.1139 2.6245 6.8023 3.1892 5.9643 1.4923 1.4202 7.0442 6.7372 10.1785 1.2494 1.9177 2.3453 1.0533 1.2914 2.3467 2.2011 6.6896 9.5398 6.7803 6.0430 6.7383 12.5633 1.0371 1.0959 1.1004 1.0855 1.0894 1.0855 1.0941 1.0894 1.0941 1.1008 1.0982 1.0990
irintensity: 0.1224 0.0572 0.8059 0.5185 0.9864 0.1635 0.2500 0.6259 0.1605 0.1379 2.5217 1.5599 2.6748 2.1816 2.6920 0.3713 10.0245 5.8340 0.1623 14.7043 4.0634 0.2697 1.2479 4.9189 16.7838 18.0034 0.4351 12.4335 36.5701 16.7397 2.4138 20.0728 33.9409 11.1246 2.0709 40.5663 5.1371 59.2653 12.6001 22.8834 100.5397 34.9215 11.7032 29.0467 5.5962 3.2917 32.1780 1.8136 3.4496 234.1951 0.2019 0.0728 1.1330 1.2752 0.3003 21.3917 7.3819 4.7064 10.3479 25.2346 7.8965 7.4723 0.0154 0.7058 0.9857 1.1313 79.0247 16.0804 248.6509 3.7315 4.9044 68.5639 93.7097 44.8490 15.4442 1.2069 7.7315 17.6756 18.5673 67.0272 59.2726 36.1970 39.8962 6.2765 28.7210 2.2303 933.1302 21.4403 15.8567 27.5010 10.1071 5.7376 0.0425 25.2022 8.1078 28.0450 30.8526 12.1105 2.5105
temp: 298.150 k
press: 1.00000 atm
elementType: 16 16 16 8 7 7 6 6 6 6 6 6 6 6 6 6 6 6 6 6 6 6 6 1 1 1 1 1 1 1 1 1 1 1 1
symmnumber: 1
zpe: 645177.8 jmol-1
zpe.correction: 0.245735 hartree
zpe.thermalcorrener: 0.266569 hartree
zpe.thermalcorrenthalpy: 0.267513 hartree
zpe.thermalcorrgfe: 0.192780 hartree
zpe.sumelectzpe: -2032.286904 hartree
zpe.sumelectthermal: -2032.266071 hartree
zpe.sumelectthermalent: -2032.265126 hartree
zpe.sumelectthermalfe: -2032.339859 hartree
dipole: 3.0499 2.5296 0.2837
dipole: 3.9725
quadrupole: -151.7091 -145.1017 -154.3903
quadrupole: -14.5265 -6.6750 -5.7665
quadrupole: -1.3087 5.2987 -3.9899 -14.5265 -6.6750 -5.7665
hfenergy: -2032.5326394 hartree
pointgroup: C01 [X(C17H12N2O1S3)]
dipole: 1.0692994 -1.1194119 0.2150215 debye
polarizability: 429.2813039|-25.9336581|260.9707375|16.7584351|-52.536004|147.9052718 unknown
InChI: InChI=1S/C17H12N2OS3/c1-11-7-5-6-10-13(11)18-16-20-14-15(22-16)23-17(21)19(14)12-8-3-2-4-9-12/h2-10H,1H3
charge 0 multiplicity 1
35 atoms
S  -1.93128 3.659402 -0.705657
S  1.160504 2.403372 -0.521185
S  -4.881431 2.668624 -0.545135
O  -0.327105 0.108311 -0.099527
N  -2.577017 1.100587 -0.265403
N  1.961595 -0.355316 0.009314
C  -1.180119 1.20603 -0.224641
C  -3.266755 -0.155109 -0.020068
C  -0.64014 2.439348 -0.431637
C  -3.234596 2.329049 -0.497677
C  1.053061 0.503318 -0.182614
C  -2.932967 -0.909817 1.127482
C  -4.249418 -0.606258 -0.928716
C  3.368045 -0.272531 -0.074295
C  4.122562 -1.194469 0.718102
C  -3.591366 -2.135834 1.362256
C  -4.906703 -1.829779 -0.678598
C  4.028412 0.64326 -0.940278
C  5.533286 -1.1467 0.629728
C  -4.580656 -2.59695 0.463841
C  3.41896 -2.174682 1.633324
C  5.435984 0.663165 -1.012502
C  6.193353 -0.229883 -0.220976
H  -2.169984 -0.548067 1.823581
H  -4.496877 -0.008516 -1.809581
H  -3.334029 -2.724998 2.248589
H  -5.670359 -2.183281 -1.379134
H  3.443394 1.312092 -1.582051
H  6.12272 -1.844462 1.235903
H  -5.093233 -3.54635 0.651971
H  2.913193 -1.651472 2.466333
H  2.631731 -2.726825 1.08999
H  4.132386 -2.897332 2.064481
H  5.936017 1.365913 -1.687519
H  7.28743 -0.219339 -0.271901
