program: Gaussian 09
title: 000178653
version: EM64L-G09RevD.01
frameworkgroup: C1[X(C6H10O4)]
method: RPBEPBE
basis: SDD
operation: Freq
keyword: #pfreq=noraman
keyword: PBEPBE/SDD
title: #p freq=noraman PBEPBE/SDD
converged: NO YES NO NO
title: Mulliken charges:
elementType: O O O O C C C C C C H H H H H H H H H H
charge: -0.248834 -0.417731 -0.447156 -0.157971 0.046506 -0.556016 -0.151261 -0.335187 0.157665 -0.369187 0.236895 0.246672 0.233413 0.222465 0.219403 0.219353 0.210122 0.194633 0.346562 0.349653
chargesum: 0.00000
title: Mulliken charges with hydrogens summed into heavy atoms:
elementType: O O O O C C C C C C
charge: -0.248834 -0.071169 -0.097503 -0.157971 0.283401 -0.075930 0.071204 0.103569 0.157665 0.035568
polarizability: 9.28034436e+01 4.20974195e-02 7.60666096e+01 3.87569705e+00 -1.76015070e+00 5.89500485e+01
1716.lowfreq: -5.3275 -0.0009 -0.0008 -0.0008 11.3366 14.6685 68.9507 72.6374 107.2278
frequency: 68.9392 72.6303 107.2032 132.3171 190.5628 224.5646 264.3099 270.1614 310.5966 347.2090 380.1919 415.7985 478.7479 529.5450 613.7785 682.1324 737.3577 791.1288 897.9161 954.1988 976.5477 989.3307 1011.7441 1033.3079 1047.6223 1055.9302 1079.8146 1140.4869 1179.5813 1190.7570 1202.3604 1230.6858 1238.9916 1257.5258 1274.8264 1305.7717 1323.2357 1350.0534 1394.1121 1416.5339 1433.8509 1459.2535 1467.5005 1651.0757 2943.1443 2947.9988 2971.3685 2975.9512 2990.4261 3010.4735 3077.8008 3078.4661 3571.5669 3585.2605
redmass: 4.9061 6.0959 3.3184 1.1347 2.9538 1.2235 2.5937 4.7503 5.1218 3.2452 5.6416 3.9386 2.6107 3.6657 4.8979 3.6990 2.6429 3.1287 2.1472 2.7714 2.0607 4.4918 3.6247 5.2502 3.1420 3.8312 1.7264 1.7180 1.2504 1.2530 1.4773 1.3635 1.1539 1.2458 1.1893 1.2649 1.3022 1.3261 1.5419 1.5193 1.0919 1.0809 1.0880 10.1724 1.0811 1.0565 1.0829 1.0644 1.0640 1.1050 1.1012 1.0994 1.0666 1.0668
irintensity: 2.2592 1.5411 1.5805 161.1100 36.7331 145.5332 0.8896 8.7514 0.8762 0.8930 9.3052 0.7762 6.5088 19.3541 24.3641 26.2646 10.0589 12.6807 17.8746 41.1052 33.7238 129.6552 20.1257 10.7447 13.8304 70.9965 12.6649 22.3983 11.5905 15.1873 57.2387 9.2952 9.8792 28.8523 1.1144 9.4203 8.8969 12.7675 9.8890 2.5582 11.6254 10.7891 7.3695 162.0051 17.6763 55.6347 13.4156 56.6140 26.9025 46.4471 38.4166 5.6767 11.9170 5.7202
temp: 298.150 k
press: 1.00000 atm
elementType: 8 8 8 8 6 6 6 6 6 6 1 1 1 1 1 1 1 1 1 1
symmnumber: 1
zpe: 414701.3 jmol-1
zpe.correction: 0.157951 hartree
zpe.thermalcorrener: 0.168604 hartree
zpe.thermalcorrenthalpy: 0.169548 hartree
zpe.thermalcorrgfe: 0.121598 hartree
zpe.sumelectzpe: -534.681605 hartree
zpe.sumelectthermal: -534.670952 hartree
zpe.sumelectthermalent: -534.670008 hartree
zpe.sumelectthermalfe: -534.717958 hartree
dipole: 2.6045 -1.7446 3.3483
dipole: 4.5868
quadrupole: -57.9277 -59.5655 -59.3217
quadrupole: 14.4308 -0.9998 1.5427
quadrupole: 1.0106 -0.6272 -0.3834 14.4308 -0.9998 1.5427
hfenergy: -534.839556 hartree
pointgroup: C01 [X(C6H10O4)]
dipole: -1.0765225 -0.5259578 -1.3494196 debye
dipolederiv: -0.8351063 0.1644908 0.0237047 0.2050895 -0.7346934 0.0591595 0.0073039 -0.0000608 -0.3770254 -0.9007947 0.2055768 0.0465474 0.1149112 -0.2983266 0.245134 -0.0237663 0.2577036 -0.3488417 -0.6464739 -0.1190819 0.2775065 -0.1553266 -0.5851267 -0.0338737 0.364692 -0.0045258 -0.3898327 -0.6966861 -0.1564423 -0.1226459 -0.2130243 -0.6353503 -0.146907 -0.2862738 -0.2403093 -0.3726824 0.3820852 -0.0082042 -0.0626568 -0.0272674 0.6579771 0.045391 -0.25656 0.0497387 0.3222603 -0.5570139 -0.0528304 -0.0995706 0.0769191 -0.1236395 0.0216469 -0.0490936 0.0404315 0.0759268 0.5085264 -0.2294582 -0.0025494 -0.2379667 -0.1587628 -0.199375 0.0411268 -0.1773223 0.2844835 0.5827306 -0.0323933 0.0516904 -0.0547015 0.3728395 -0.0296666 0.0577241 -0.148332 0.3117063 0.9551833 -0.0123678 0.2621795 0.0114106 0.8392887 0.2702033 0.4420127 0.3932995 0.2419497 0.5439423 0.1837852 -0.1912678 0.1367699 0.4092162 -0.0339304 -0.2163797 -0.0134681 0.3348506 0.0481843 -0.0215373 -0.0327776 0.0329115 -0.0172651 0.0225535 0.0469803 -0.029035 -0.1374066 0.0614557 0.0223751 0.0095439 0.0531069 -0.0808381 -0.0475552 0.0235993 -0.0752961 0.069109 0.0860534 0.0072604 -0.0160792 0.0114708 0.1035177 -0.0200986 -0.0071745 0.025763 -0.0968152 0.0008206 0.0413126 -0.0342458 0.0212309 0.0305844 0.0172386 -0.0398026 0.0284966 -0.1626181 0.016652 0.0367514 -0.0027262 0.0492064 -0.145513 -0.0423769 0.0207715 -0.0835631 0.0654596 -0.0103896 0.0235444 0.0001171 -0.016051 0.066914 -0.0281656 -0.0230036 0.0853895 -0.1575657 0.0190606 -0.0271428 0.026589 -0.0653839 0.0449359 -0.0650525 0.0283113 -0.0208127 -0.1706743 -0.0085676 -0.0049705 0.0347175 -0.01479 -0.2297516 0.056244 0.0553307 0.0075426 0.0387436 0.3561688 -0.0116804 -0.048397 0.0610502 0.1158358 -0.1487827 -0.0264224 -0.1475629 0.2494856 0.0941691 -0.0089877 -0.1196797 0.0104344 0.3681576 0.0582135 -0.1593759 0.0519231 0.2194871 unknown
polarizability: 92.6915121|-1.6005541|75.9585879|3.9120429|2.4201262|59.1700017 unknown
InChI: InChI=1S/C6H10O4/c7-2-4-1-5(8)6(9)3-10-4/h4,6-7,9H,1-3H2
charge 0 multiplicity 1
20 atoms
O  -0.86712 -1.084943 -0.353912
O  2.866273 -1.030569 0.18624
O  -3.536943 -0.054989 0.652041
O  2.097682 1.568522 0.633411
C  -1.193176 0.252459 0.179873
C  -0.136918 1.278473 -0.324295
C  1.587079 -0.62212 -0.372022
C  0.430722 -1.54249 0.140612
C  1.283078 0.828549 0.034418
C  -2.607099 0.592392 -0.280201
H  -1.182187 0.217929 1.290595
H  -0.308417 2.274154 0.12052
H  -0.229867 1.360794 -1.426058
H  1.578381 -0.660974 -1.485078
H  0.550132 -2.568389 -0.247001
H  0.457095 -1.565128 1.250382
H  -2.73557 0.225767 -1.319927
H  -2.744933 1.694766 -0.263524
H  3.159596 -1.868503 -0.252622
H  -4.440007 -0.098898 0.250946
