program: Gaussian 09
title: 000178680
version: EM64L-G09RevD.01
frameworkgroup: C1[X(C18H14N2OS3)]
method: RPBEPBE
basis: SDD
operation: Freq
keyword: #p
keyword: freq=noraman
keyword: PBEPBE/SDD
title: #p freq=noraman PBEPBE/SDD
converged: YES YES NO NO
title: Mulliken charges:
elementType: S S S O N N C C C C C C C C C C C C C C C C C C H H H H H H H H H H H H H H
charge: 0.337515 0.270105 0.117667 -0.188198 -0.219214 0.082212 0.683773 0.455185 -0.725058 -0.585173 -0.343477 -0.337539 0.448950 -0.235381 -0.381927 -0.368264 0.134047 0.310087 -0.805452 -0.341513 -0.381169 -0.793195 -0.238788 -0.237190 0.248821 0.272777 0.236467 0.237069 0.228272 0.227853 0.241466 0.246079 0.235824 0.236293 0.251702 0.217639 0.231502 0.230234
chargesum: 0.00000
title: Mulliken charges with hydrogens summed into heavy atoms:
elementType: S S S O N N C C C C C C C C C C C C C C C C C C
charge: 0.337515 0.270105 0.117667 -0.188198 -0.219214 0.082212 0.683773 0.455185 -0.725058 -0.585173 -0.094656 -0.064762 0.448950 -0.235381 -0.145460 -0.131195 0.134047 0.310087 -0.107862 -0.095434 -0.145345 -0.087561 -0.007285 -0.006955
polarizability: 4.42666974e+02 1.79564814e+01 2.97931836e+02 -5.59205351e+00 -1.63331635e+01 1.40734813e+02
1716.lowfreq: -4.0572 -1.7572 0.0019 0.0023 0.0027 2.3440 12.8394 25.8755 33.2524
frequency: 12.6969 25.8239 33.2522 41.3755 43.9836 54.1886 59.6222 83.9790 91.5943 113.1541 128.4330 161.2771 174.0915 188.9232 208.3713 214.6661 236.7931 281.7101 301.1804 316.9053 321.7664 353.9398 377.0407 395.8773 403.1958 409.7573 444.7492 450.3628 493.7126 498.6143 525.8417 526.2087 532.6382 542.5966 550.8945 587.5245 599.9437 633.5898 637.5847 681.4544 719.1879 721.3240 729.9583 763.7611 766.2476 802.5886 822.2879 834.6022 839.3254 864.5816 902.1805 942.1975 949.5152 957.5407 969.4202 983.1566 985.4564 990.0511 1003.9214 1009.3409 1046.3831 1047.4322 1048.0178 1050.1913 1117.5578 1125.8892 1175.4665 1191.1262 1202.7072 1222.4519 1229.3489 1236.0398 1269.2383 1283.7007 1310.9340 1365.2962 1371.6220 1385.8447 1398.8062 1400.8598 1413.8598 1427.3194 1456.2921 1472.0458 1474.4668 1476.3685 1483.9181 1504.2628 1579.9243 1589.4575 1598.6541 1604.6186 1621.3300 1738.7769 2978.6022 2983.6321 3060.4467 3063.2501 3089.0990 3093.4370 3124.8377 3130.4961 3133.2294 3135.7331 3145.4145 3162.8819 3165.5646 3175.6778
redmass: 3.9802 7.2973 5.1914 1.4989 1.9620 5.9929 5.5401 1.0887 8.3710 8.1063 5.0894 4.8799 5.8550 8.0335 5.1830 8.5125 5.7117 9.0849 6.9164 4.5763 5.2461 5.4463 13.1212 4.4219 4.7561 3.0122 3.5056 6.4403 3.5213 8.1552 8.8605 7.1933 7.2029 6.2673 4.7743 8.0427 10.4955 8.6661 6.9714 5.9044 4.8010 2.5572 3.8053 1.6733 3.5429 5.5060 1.7515 1.2870 4.0800 1.3168 9.4467 1.3791 1.4226 6.6042 1.3894 1.3259 1.6281 1.4196 10.6678 3.7783 1.8444 1.7746 1.5751 4.3102 1.8023 1.2891 1.0641 1.1246 2.6471 2.7063 7.3447 3.1854 6.4808 1.4902 1.3670 6.3539 7.1488 9.1538 1.2197 1.2496 3.1179 1.9191 1.0566 1.1036 1.0581 1.2598 2.2945 2.7043 6.7252 7.3255 9.7515 6.1162 6.5058 12.5552 1.0387 1.0372 1.0950 1.0959 1.0999 1.1004 1.0859 1.0893 1.0893 1.0898 1.0940 1.0962 1.1008 1.0959
irintensity: 0.1606 0.0800 0.7558 0.8463 0.3457 0.6407 0.2390 0.5813 0.2706 0.0997 0.2222 1.3625 1.2638 2.0310 2.8909 2.7580 1.4047 6.0613 3.4645 4.9651 0.6811 1.1196 16.5830 0.3497 2.1675 1.4003 4.7359 18.8140 37.9691 0.6137 40.3032 15.8303 11.2467 11.3677 1.1925 21.3087 5.6343 30.7590 11.5448 14.4096 17.0290 14.2135 19.6659 64.9904 31.8984 1.6367 56.9907 2.1990 23.6835 3.6128 31.4996 3.9670 17.9550 216.6584 0.4288 0.1209 1.0630 6.1697 18.8824 9.8025 3.7975 10.1334 20.6679 22.4865 7.6923 9.2895 0.5538 1.3100 1.0620 5.7167 76.7179 13.1211 245.3268 3.5269 8.9125 79.6515 7.4123 103.5588 13.9183 14.7556 17.8306 1.4762 18.7332 11.3910 11.1028 19.6194 58.4470 92.2426 38.7310 15.4160 16.6147 29.1117 4.7534 946.4842 31.9189 21.6163 18.7299 15.9182 16.1020 27.2262 11.2372 5.5604 11.5244 20.5477 24.3495 6.1895 31.6652 1.2101
temp: 298.150 k
press: 1.00000 atm
elementType: 16 16 16 8 7 7 6 6 6 6 6 6 6 6 6 6 6 6 6 6 6 6 6 6 1 1 1 1 1 1 1 1 1 1 1 1 1 1
symmnumber: 1
zpe: 715716.6 jmol-1
zpe.correction: 0.272602 hartree
zpe.thermalcorrener: 0.295388 hartree
zpe.thermalcorrenthalpy: 0.296332 hartree
zpe.thermalcorrgfe: 0.216570 hartree
zpe.sumelectzpe: -2071.516922 hartree
zpe.sumelectthermal: -2071.494136 hartree
zpe.sumelectthermalent: -2071.493192 hartree
zpe.sumelectthermalfe: -2071.572954 hartree
dipole: 2.2797 3.4098 0.2872
dipole: 4.1117
quadrupole: -151.5582 -154.4699 -160.0768
quadrupole: -18.1039 -5.4570 -6.8238
quadrupole: 3.8101 0.8984 -4.7085 -18.1039 -5.4570 -6.8238
hfenergy: -2071.7895239 hartree
pointgroup: C01 [X(C18H14N2O1S3)]
dipole: 0.7457023 -1.4242244 0.1800275 debye
polarizability: 437.0942352|-31.8264027|290.0378077|9.9649902|-47.8999155|154.2015803 unknown
InChI: InChI=1S/C18H14N2OS3/c1-11-7-9-13(10-8-11)20-15-16(24-18(20)22)23-17(21-15)19-14-6-4-3-5-12(14)2/h3-10H,1-2H3
charge 0 multiplicity 1
38 atoms
S  -1.32881 4.029613 -0.515861
S  1.620386 2.460942 -0.379758
S  -4.36616 3.328357 -0.436495
O  -0.094882 0.306932 -0.098884
N  -2.232052 1.527816 -0.2278
N  2.134836 -0.388161 -0.001204
C  -0.832752 1.490228 -0.170967
C  -3.047435 0.334241 -0.078682
C  -0.169386 2.672507 -0.30332
C  -2.761041 2.825942 -0.393279
C  -2.834611 -0.51872 1.026508
C  -4.032827 0.029416 -1.042445
C  -4.619187 -2.011511 0.212392
C  1.317042 0.566083 -0.150099
C  -3.61533 -1.685361 1.160114
C  -4.809484 -1.136469 -0.889052
C  3.54373 -0.430651 -0.087425
C  4.217514 -1.423364 0.691436
C  -5.482396 -3.248204 0.383245
C  4.277141 0.429109 -0.951723
C  5.626225 -1.501776 0.592098
C  3.433957 -2.344806 1.602876
C  5.680203 0.322728 -1.035597
C  6.36004 -0.641247 -0.25714
H  -2.065665 -0.279359 1.767579
H  -4.189306 0.695311 -1.89504
H  -3.443911 -2.348742 2.015523
H  -5.573161 -1.372444 -1.639058
H  -5.785816 -3.668655 -0.591538
H  -4.95546 -4.036844 0.94792
H  -6.409343 -3.008174 0.939494
H  3.748484 1.152099 -1.583657
H  6.154725 -2.254992 1.188022
H  2.985392 -1.786962 2.446179
H  2.594982 -2.815188 1.060005
H  4.080769 -3.135365 2.019697
H  6.236232 0.982816 -1.709911
H  7.450157 -0.729244 -0.317252
