program: Gaussian 09
title: 000178660
version: EM64L-G09RevD.01
frameworkgroup: C1[X(C17H18O3)]
method: RPBEPBE
basis: SDD
operation: Freq
keyword: #pfreq=noraman
keyword: PBEPBE/SDD
title: #p freq=noraman PBEPBE/SDD
converged: NO YES NO NO
title: Mulliken charges:
elementType: O O O C C C C C C C C C C C C C C C C C H H H H H H H H H H H H H H H H H H
charge: -0.377633 -0.458147 -0.217689 0.132414 0.499249 -0.700224 -0.698520 -0.748502 -0.413927 -0.431120 0.341471 -0.433348 -0.414608 0.402981 -0.477392 -0.381139 0.145679 -0.405581 0.160197 0.089235 0.208430 0.214872 0.223625 0.214960 0.208367 0.224102 0.217721 0.216876 0.217300 0.225912 0.247024 0.229685 0.238079 0.294260 0.244848 0.220501 0.357990 0.382052
chargesum: 0.00000
title: Mulliken charges with hydrogens summed into heavy atoms:
elementType: O O O C C C C C C C C C C C C C C C C C
charge: -0.019642 -0.076095 -0.217689 0.132414 0.499249 -0.053297 -0.051091 -0.096605 -0.188016 -0.184096 0.341471 -0.203663 -0.176529 0.402981 -0.183131 -0.136290 0.145679 -0.185080 0.160197 0.089235
polarizability: 3.29474659e+02 5.53746237e+00 1.96182577e+02 2.28133217e+00 -5.41150729e+00 1.08196412e+02
1716.lowfreq: -3.5064 -0.0008 -0.0007 -0.0006 1.0026 8.9500 31.5663 36.4179 41.4258
frequency: 31.2945 35.8069 40.8700 62.6212 65.3559 105.2750 137.4302 166.9044 190.2623 209.8440 217.5432 237.6651 258.2790 289.8537 301.3160 314.9791 330.0784 361.9783 374.8012 382.1360 401.9717 409.8038 414.5316 426.1186 436.8379 464.8052 514.1399 530.6580 546.2357 568.9529 596.5150 614.8548 630.4088 640.7609 699.6897 717.9364 749.6774 756.1610 766.1773 812.0836 832.1240 843.3130 847.9057 861.9418 918.4047 930.5524 935.9216 943.3070 954.9726 961.6944 972.1818 977.1385 1007.2702 1020.8672 1024.1347 1043.4717 1093.1106 1115.9698 1131.2024 1151.9679 1175.1690 1204.6985 1210.5923 1218.3430 1259.1851 1273.6616 1279.7546 1298.9100 1309.0922 1317.7242 1344.7468 1373.9042 1376.4410 1383.0409 1403.6279 1408.2960 1415.4229 1459.3627 1465.3919 1468.1118 1478.1654 1485.9605 1489.7010 1497.1019 1520.3280 1567.2376 1593.8703 1614.3948 1621.4607 1656.0901 2972.1020 2972.8634 2978.0430 3067.2476 3067.4906 3069.6848 3076.0089 3077.8582 3080.5104 3113.7024 3119.3141 3130.7406 3143.4375 3151.3755 3165.6893 3180.4626 3534.7720 3549.2412
redmass: 8.0599 4.2342 4.5011 5.3803 3.6051 4.6792 4.2352 4.5692 1.7083 2.7398 2.3932 2.7272 1.2151 3.6146 1.0845 3.0229 3.9119 2.8002 4.2740 5.2107 1.2340 2.8549 3.8987 2.7809 4.0327 3.2000 3.8182 3.3991 2.6289 1.7806 1.7399 4.8347 5.9482 6.6995 4.6191 5.8038 4.3955 4.4007 4.4817 1.5401 2.6794 1.5004 1.4254 5.5602 1.7375 1.6392 1.4914 1.2180 1.3659 1.3538 1.3815 4.9935 3.2426 1.4516 1.3879 2.9470 1.9884 2.1927 1.4857 1.5446 1.1744 2.9657 1.2033 2.2494 3.0783 3.1448 1.9995 1.7545 1.4623 1.8937 4.0030 1.2077 1.3853 3.7346 1.2168 4.9729 3.3748 1.0507 1.0490 1.0669 1.0951 1.0515 2.1370 1.1174 2.8304 6.1437 6.6304 6.5587 6.2904 8.6701 1.0349 1.0346 1.0357 1.0998 1.0999 1.1006 1.0984 1.0995 1.0992 1.0886 1.0864 1.0885 1.0953 1.0947 1.0937 1.0913 1.0642 1.0658
irintensity: 0.6763 0.2967 0.9326 0.1983 0.0280 0.3851 3.0058 0.5030 0.9398 0.1525 0.8620 1.7625 0.1472 2.8656 0.1918 1.0231 2.0448 0.0117 0.5935 7.1484 122.4757 0.6302 7.7032 0.2579 7.5147 1.7533 20.0752 13.7964 4.1992 76.3859 92.1850 43.4030 9.8634 4.2345 18.7148 2.1319 6.1388 7.8449 2.8665 71.5175 13.3125 22.0293 18.7593 14.0995 3.3040 2.1576 5.2275 0.2111 4.4032 0.5825 1.7577 225.2427 9.6085 4.2320 0.1575 7.1197 155.0433 40.8637 4.2808 163.3699 12.1541 6.5037 0.2654 1.6921 36.1361 64.6591 15.1715 78.9553 30.9575 23.4256 10.5712 19.4997 16.8643 33.2106 12.6587 2.4226 10.5128 0.0607 0.8180 2.8432 18.2517 12.5504 92.9475 55.8759 1.2348 2.7124 40.1566 1.1131 0.2743 399.6572 31.6931 32.9128 39.0330 4.0966 4.2429 13.9148 148.9136 36.5036 43.5379 25.0085 13.1021 16.2326 18.0883 14.7665 10.5401 2.6326 39.1632 51.4324
temp: 298.150 k
press: 1.00000 atm
elementType: 8 8 8 6 6 6 6 6 6 6 6 6 6 6 6 6 6 6 6 6 1 1 1 1 1 1 1 1 1 1 1 1 1 1 1 1 1 1
symmnumber: 1
zpe: 801500.4 jmol-1
zpe.correction: 0.305275 hartree
zpe.thermalcorrener: 0.324365 hartree
zpe.thermalcorrenthalpy: 0.325309 hartree
zpe.thermalcorrgfe: 0.257452 hartree
zpe.sumelectzpe: -882.847745 hartree
zpe.sumelectthermal: -882.828656 hartree
zpe.sumelectthermalent: -882.827712 hartree
zpe.sumelectthermalfe: -882.895569 hartree
dipole: 3.1004 -2.2552 -0.2967
dipole: 3.8453
quadrupole: -126.7531 -97.8630 -121.7027
quadrupole: 12.0694 2.1602 -1.0421
quadrupole: -11.3135 17.5766 -6.2631 12.0694 2.1602 -1.0421
hfenergy: -883.1530207 hartree
pointgroup: C01 [X(C17H18O3)]
dipole: -1.2247457 -0.8783009 0.1316647 debye
polarizability: 329.3881571|-6.1414503|196.4468187|3.5529068|3.2632533|108.0186728 unknown
InChI: InChI=1S/C17H18O3/c1-17(2,3)13-7-4-11(5-8-13)12-6-9-15(18)14(10-12)16(19)20/h4-10,18-19H,1-3H3
charge 0 multiplicity 1
38 atoms
O  5.208166 -1.261028 0.197425
O  3.499229 2.654619 -0.271835
O  5.483719 1.458868 -0.206715
C  -4.856107 0.313102 -0.037744
C  -3.324609 0.101451 0.014269
C  -5.561743 -0.813884 0.775877
C  -5.333208 0.251588 -1.520688
C  -5.283636 1.681012 0.554011
C  -2.756028 -1.104733 -0.479083
C  -2.428538 1.068466 0.536226
C  -0.471234 -0.360829 0.07187
C  -1.367114 -1.332647 -0.453118
C  -1.035117 0.843709 0.566277
C  0.999413 -0.598426 0.100162
C  1.919594 0.467007 -0.035915
C  1.533538 -1.906872 0.268161
C  3.326994 0.276547 -0.007648
C  2.919798 -2.128111 0.29747
C  3.830874 -1.049233 0.161968
C  4.233124 1.443306 -0.164434
H  -6.659373 -0.679882 0.740416
H  -5.330517 -1.816144 0.37238
H  -5.243595 -0.793467 1.834325
H  -5.088024 -0.718936 -1.988266
H  -6.429897 0.387327 -1.575298
H  -4.854682 1.046792 -2.121087
H  -6.382808 1.782838 0.493685
H  -4.996689 1.776088 1.617677
H  -4.839289 2.525934 -0.003997
H  -3.405601 -1.879185 -0.903065
H  -2.81169 2.011209 0.937285
H  -0.971904 -2.263598 -0.876543
H  -0.382509 1.606337 1.006765
H  1.558541 1.485683 -0.196205
H  0.857008 -2.756991 0.406312
H  3.306092 -3.145995 0.439945
H  5.405412 -2.225125 0.317083
H  4.156607 3.392801 -0.379444
