program: Gaussian 09
title: 000178651
version: EM64L-G09RevD.01
frameworkgroup: C1[X(C11H12O4)]
method: RPBEPBE
basis: SDD
operation: Freq
keyword: #pfreq=noraman
keyword: PBEPBE/SDD
title: #p freq=noraman PBEPBE/SDD
converged: YES YES NO NO
title: Mulliken charges:
elementType: O O O O C C C C C C C C C C C H H H H H H H H H H H H
charge: -0.221628 -0.261617 -0.431605 -0.234654 0.111606 -0.056708 0.233985 -0.422198 0.057761 0.399818 -0.567840 0.168932 -0.443963 -0.795963 -0.523959 0.241512 0.244559 0.279871 0.243746 0.199358 0.246708 0.218172 0.239297 0.216079 0.228567 0.289812 0.340352
chargesum: 0.00000
title: Mulliken charges with hydrogens summed into heavy atoms:
elementType: O O O O C C C C C C C C C C C
charge: -0.221628 -0.261617 -0.091253 -0.234654 0.111606 -0.056708 0.233985 0.063874 0.057761 0.399818 -0.287970 0.168932 -0.000859 -0.091785 0.210498
polarizability: 1.75104696e+02 5.92857852e+00 1.53251265e+02 2.80938684e+00 -4.33240684e-01 7.42980421e+01
1716.lowfreq: -11.7869 -5.5259 0.0005 0.0006 0.0010 6.3159 47.7262 62.1088 91.1779
frequency: 47.7172 62.1027 91.1648 106.7782 131.6245 135.1114 155.9750 174.5407 200.3851 233.3656 258.0324 267.3868 296.7031 302.3352 365.3925 385.6513 434.9502 459.1194 489.2718 501.2319 583.2823 598.9473 631.8555 670.4154 694.2687 699.6428 760.8825 862.0402 881.3870 908.6724 940.8532 961.1624 968.9095 985.8736 994.4369 1006.3185 1040.1137 1051.3824 1094.0207 1115.8819 1141.2248 1157.0677 1165.4862 1227.4165 1237.2546 1286.9744 1305.4813 1313.9530 1363.7363 1388.5821 1400.8893 1408.3275 1429.6815 1453.7009 1455.4332 1460.5093 1468.3064 1470.2521 1472.9228 1485.0116 1589.2024 1618.4070 1683.0355 2948.8053 2987.6278 2991.0201 2999.9970 3043.2681 3054.1150 3066.3029 3096.6418 3105.7041 3142.4603 3144.0533 3554.2082
redmass: 4.0108 3.4389 3.0927 2.7041 2.5754 1.2033 1.7379 3.5139 3.0004 3.3537 3.3028 3.5732 3.2692 2.8431 2.2356 2.2943 5.3974 6.0187 4.3143 5.1930 6.3347 3.9778 5.4593 5.0047 6.2120 7.5995 6.2452 6.8676 5.7086 1.3858 4.1436 2.2300 6.0686 4.5089 1.9483 2.1362 2.5020 1.5438 4.3305 1.2474 1.0732 1.3603 1.1777 1.6679 3.5434 8.0986 1.3442 1.4607 1.4125 3.0086 1.5434 2.6102 1.7003 1.0517 1.0496 1.1153 1.5955 1.0887 1.0696 1.4422 8.5248 7.3914 11.8086 1.0681 1.0366 1.0333 1.0579 1.0936 1.1062 1.0965 1.1007 1.0988 1.0913 1.1062 1.0661
irintensity: 3.5552 9.8913 3.1157 3.2089 0.6988 0.3772 2.7259 2.6402 6.5782 9.9338 9.4538 3.7878 2.0719 12.2584 88.3036 88.9583 7.7293 3.7438 10.6846 1.7005 5.3160 1.8755 2.4699 16.2534 1.4267 2.5373 6.8227 72.3247 14.2067 20.9673 87.1937 33.2053 20.6573 23.9209 13.2496 11.5971 92.6800 7.3691 63.7827 3.3552 2.5031 2.7057 36.4454 6.7903 66.8206 105.1486 13.9760 10.2790 38.3233 12.0780 10.9019 11.0208 21.6008 30.6015 10.4422 17.6785 56.8815 2.6172 41.0491 67.7666 30.0328 42.5339 396.1102 54.1438 23.3938 60.1229 31.0622 17.3644 9.5885 14.1368 16.8702 36.3870 3.7445 3.7762 8.1308
temp: 298.150 k
press: 1.00000 atm
elementType: 8 8 8 8 6 6 6 6 6 6 6 6 6 6 6 1 1 1 1 1 1 1 1 1 1 1 1
symmnumber: 1
zpe: 548285.9 jmol-1
zpe.correction: 0.208831 hartree
zpe.thermalcorrener: 0.223525 hartree
zpe.thermalcorrenthalpy: 0.224469 hartree
zpe.thermalcorrgfe: 0.167123 hartree
zpe.sumelectzpe: -726.140138 hartree
zpe.sumelectthermal: -726.125445 hartree
zpe.sumelectthermalent: -726.124501 hartree
zpe.sumelectthermalfe: -726.181846 hartree
dipole: -2.1288 1.7431 1.8379
dipole: 3.3088
quadrupole: -98.4757 -89.7232 -83.5498
quadrupole: 14.2151 2.0314 0.8545
quadrupole: -7.8928 0.8597 7.0331 14.2151 2.0314 0.8545
hfenergy: -726.3489695 hartree
pointgroup: C01 [X(C11H12O4)]
dipole: 0.7366097 -0.8341573 0.6754639 debye
polarizability: 175.6799747|1.3542785|151.8192416|-9.7158337|0.7141567|75.1547868 unknown
InChI: InChI=1S/C11H12O4/c1-6-3-7(4-12)8-5-15-11(13)9(8)10(6)14-2/h3,12H,4-5H2,1-2H3
charge 0 multiplicity 1
27 atoms
O  -0.225011 2.80754 0.039583
O  -2.411664 -1.254589 0.178231
O  4.042575 -1.208101 0.319924
O  -2.442829 2.14334 -0.009419
C  0.832807 0.683101 -0.053841
C  -0.571132 0.473446 0.041335
C  1.747098 -0.372107 -0.188026
C  1.110863 2.172204 -0.024877
C  -1.08801 -0.85546 0.045154
C  -0.174679 -1.948147 -0.127297
C  1.205966 -1.685783 -0.237622
C  -1.245493 1.80397 0.035607
C  3.246421 -0.14062 -0.305269
C  -0.709719 -3.364033 -0.168275
C  -3.3901 -0.458433 0.954501
H  1.685905 2.495852 0.862624
H  1.611688 2.546438 -0.935939
H  1.898605 -2.526908 -0.353813
H  3.574244 -0.162095 -1.360104
H  3.521325 0.852085 0.1122
H  -1.387467 -3.508409 -1.029404
H  0.112657 -4.094992 -0.242738
H  -1.308776 -3.589113 0.732364
H  -2.947484 -0.14786 1.919182
H  -4.226715 -1.152152 1.126121
H  -3.70799 0.432129 0.394325
H  3.769815 -1.296703 1.268773
