program: Gaussian 09
title: 000178650
version: EM64L-G09RevD.01
frameworkgroup: C1[X(C11H10O6)]
method: RPBEPBE
basis: SDD
operation: Freq
keyword: #pfreq=noraman
keyword: PBEPBE/SDD
title: #p freq=noraman PBEPBE/SDD
converged: YES YES NO NO
title: Mulliken charges:
elementType: O O O O O O C C C C C C C C C C C H H H H H H H H H H
charge: -0.210658 -0.250103 -0.365182 -0.226258 -0.440573 -0.231713 0.140198 -0.058434 -0.191340 0.169264 0.069512 0.415328 -0.549919 0.173467 -0.791916 0.088236 -0.520205 0.287817 0.288067 0.249462 0.223090 0.242092 0.352762 0.233474 0.293512 0.220093 0.389924
chargesum: 0.00000
title: Mulliken charges with hydrogens summed into heavy atoms:
elementType: O O O O O O C C C C C C C C C C C
charge: -0.210658 -0.250103 -0.012420 -0.226258 -0.050648 -0.231713 0.140198 -0.058434 0.096477 0.169264 0.069512 0.415328 -0.261852 0.173467 -0.077272 0.088236 0.226874
polarizability: 2.03099382e+02 1.55650233e+00 1.58162510e+02 6.35404739e-01 3.05948418e+00 7.48591831e+01
1716.lowfreq: -5.9288 -2.7842 -0.0004 0.0002 0.0007 2.9701 51.5761 57.4367 79.9783
frequency: 51.5559 57.4294 79.9779 99.2523 116.3953 131.6327 132.4939 145.4132 155.7880 213.2762 225.7156 254.3614 279.1265 308.1289 329.0616 331.3271 356.2502 396.6443 449.8427 453.4222 471.4586 507.8681 557.2344 587.4674 595.0397 620.6992 642.3864 680.9708 689.3286 714.1257 737.9046 781.3130 830.7501 867.3559 883.8382 933.8056 934.6699 981.5543 1004.0757 1033.7344 1050.8965 1054.5909 1100.2480 1116.1771 1159.1645 1197.7078 1232.1037 1242.4134 1255.6676 1267.9066 1326.6500 1372.7033 1377.6988 1402.4623 1410.6721 1434.4628 1452.9588 1455.8784 1467.9418 1473.0067 1483.5649 1576.3212 1614.7815 1641.6101 1679.6881 2989.8379 2998.0733 3068.5644 3100.6875 3113.9055 3139.5966 3152.1274 3171.8154 3531.6480 3538.5822
redmass: 7.4886 4.0434 7.6221 1.5385 5.3085 6.3504 1.3646 2.7022 2.5419 3.9650 3.5719 3.4795 4.3923 3.1834 7.1639 1.8573 4.2374 4.7877 5.7587 5.7682 5.4373 3.9160 5.6226 4.1088 1.7531 4.3076 4.2519 6.3486 6.2995 5.7875 8.3847 7.2047 7.4210 6.8103 9.4191 1.6262 4.4372 4.7758 2.1517 3.2399 2.6291 1.7420 2.7062 1.2489 1.3853 1.5645 2.6719 1.6427 1.6567 2.6162 3.6354 3.2761 1.4131 1.4354 3.0320 1.6845 1.0515 1.0472 1.0569 1.5390 1.7101 9.7048 7.1872 8.8678 11.8714 1.0368 1.0328 1.0965 1.1007 1.0996 1.0874 1.1065 1.0921 1.0642 1.0660
irintensity: 0.2238 2.5386 0.8642 5.0130 0.5237 1.9673 0.9920 2.0654 1.7023 2.1126 0.6913 6.7070 4.2264 20.2969 8.4735 45.5306 19.6350 36.4246 9.4376 10.6214 22.0264 34.3655 2.9197 37.3897 55.8224 51.2910 52.6909 18.3066 8.1096 17.6857 4.4637 17.0080 130.7545 51.0033 67.1181 22.9966 47.8542 93.5346 7.2273 191.0385 169.9513 37.9393 267.8838 2.7752 9.1277 8.6005 53.4070 24.8530 38.6613 77.4568 171.6182 16.8747 48.6249 21.7473 5.7758 14.2894 39.4193 12.8848 53.7568 28.1413 81.7874 13.0463 151.1663 277.1701 345.8317 17.9953 54.3087 12.0029 14.6204 31.8609 1.4669 3.0691 1.4308 59.2028 13.1574
temp: 298.150 k
press: 1.00000 atm
elementType: 8 8 8 8 8 8 6 6 6 6 6 6 6 6 6 6 6 1 1 1 1 1 1 1 1 1 1
symmnumber: 1
zpe: 510056.5 jmol-1
zpe.correction: 0.194270 hartree
zpe.thermalcorrener: 0.210433 hartree
zpe.thermalcorrenthalpy: 0.211377 hartree
zpe.thermalcorrgfe: 0.150738 hartree
zpe.sumelectzpe: -875.275890 hartree
zpe.sumelectthermal: -875.259728 hartree
zpe.sumelectthermalent: -875.258784 hartree
zpe.sumelectthermalfe: -875.319422 hartree
dipole: 0.8099 5.6341 2.0609
dipole: 6.0536
quadrupole: -92.4878 -108.3092 -94.1599
quadrupole: -2.6994 5.8000 -3.1483
quadrupole: 5.8312 -9.9902 4.1591 -2.6994 5.8000 -3.1483
hfenergy: -875.4701603 hartree
pointgroup: C01 [X(C11H10O6)]
dipole: -0.3553791 -2.2661814 0.6406993 debye
polarizability: 202.7179696|0.4037531|158.0241823|-7.4889438|4.0196763|75.3789232 unknown
InChI: InChI=1S/C11H10O6/c1-4-3-5(9(12)13)6-7(8(4)16-2)11(15)17-10(6)14/h3,10,12,14H,1-2H3
charge 0 multiplicity 1
27 atoms
O  -0.170264 2.642488 0.029156
O  -2.850891 -1.111368 0.167863
O  1.764062 2.140233 1.378625
O  -2.443941 2.249786 -0.175254
O  3.44826 -1.979014 -0.13447
O  3.530372 0.314556 -0.493494
C  0.609397 0.400373 0.02357
C  -0.807144 0.369814 0.064949
C  1.097783 1.839605 0.146174
C  1.37645 -0.773231 -0.098819
C  -1.49338 -0.881967 0.067178
C  -0.72471 -2.09138 -0.062091
C  0.675039 -2.012724 -0.147572
C  -1.30001 1.78342 -0.02008
C  -1.440597 -3.423781 -0.098652
C  2.850756 -0.712086 -0.255185
C  -3.783928 -0.146777 0.798638
H  1.78217 2.176562 -0.641793
H  1.257518 -2.93282 -0.247159
H  -2.143947 -3.473746 -0.949336
H  -0.72215 -4.255359 -0.184766
H  -2.049738 -3.572478 0.811174
H  1.228738 1.808543 2.145826
H  -4.710226 -0.723548 0.935306
H  -3.937475 0.730664 0.155737
H  -3.385671 0.177044 1.777437
H  4.428725 -1.881808 -0.270959
