program: Gaussian 09
title: 000178665
version: EM64L-G09RevD.01
frameworkgroup: C1[X(C18H18N2O)]
method: RPBEPBE
basis: SDD
operation: Freq
keyword: #p
keyword: freq=noraman
keyword: PBEPBE/SDD
title: #p freq=noraman PBEPBE/SDD
converged: YES YES NO NO
title: Mulliken charges:
elementType: O N N C C C C C C C C C C C C C C C C C C H H H H H H H H H H H H H H H H H H
charge: -0.284881 -0.185399 -0.084568 0.271438 0.398753 -0.348774 -0.576232 -0.448548 0.391747 -0.256417 -0.408298 -0.651707 -0.369701 -0.235384 -0.414528 0.429326 -0.425278 -0.381453 -0.223519 -0.218844 -0.239057 0.229484 0.215668 0.273199 0.264481 0.254511 0.234790 0.228374 0.217671 0.246793 0.254011 0.224723 0.220971 0.223295 0.228235 0.260465 0.227195 0.227935 0.229521
chargesum: 0.00000
title: Mulliken charges with hydrogens summed into heavy atoms:
elementType: O N N C C C C C C C C C C C C C C C C C C
charge: -0.284881 -0.185399 -0.084568 0.271438 0.398753 0.096378 -0.303033 -0.184066 0.391747 -0.001906 -0.173508 0.041132 -0.115690 -0.010661 0.029739 0.429326 -0.197043 -0.120989 0.003676 0.009091 -0.009536
polarizability: 3.03767474e+02 1.12675891e+01 2.16382901e+02 -7.96967132e+00 -4.73562772e+00 1.21564980e+02
1716.lowfreq: -0.0009 -0.0008 -0.0004 2.6670 4.1457 7.7438 17.0572 20.7409 44.0356
frequency: 17.0482 20.7205 44.0317 44.7902 54.0798 81.3104 108.4010 115.8512 137.8192 184.9443 197.7951 216.9139 227.7105 260.1824 277.4586 324.0814 361.0756 388.3034 401.8884 424.5694 460.8440 466.0126 501.4935 527.9695 597.0547 615.6146 625.0401 650.2606 658.7451 676.7456 680.8548 702.2990 704.0793 743.6499 769.7773 781.9805 792.9257 816.5425 825.6336 839.6908 855.5320 877.1775 891.1474 901.3511 913.7736 959.5481 966.2858 976.0152 978.7873 989.4537 990.2287 996.0767 1012.8591 1027.6738 1043.9078 1074.3423 1086.5231 1091.6696 1101.5329 1111.3728 1172.8212 1174.6466 1186.6673 1190.9119 1202.7925 1210.5778 1217.5409 1227.1294 1243.3446 1286.8800 1293.1877 1315.2454 1339.6289 1344.3548 1357.4811 1359.5472 1383.2731 1389.9865 1394.4414 1419.2091 1438.3221 1441.3235 1459.8422 1467.3086 1473.3674 1480.9477 1486.9921 1492.9501 1542.3218 1580.1900 1596.6921 1618.7831 1620.2353 2936.5519 2992.5834 2997.8679 3022.3631 3073.9524 3092.2816 3105.4598 3114.9718 3128.5279 3131.0868 3142.1077 3153.8328 3157.9712 3162.6066 3170.0716 3170.8716 3222.1452 3228.1633
redmass: 3.7735 4.3655 5.7817 4.8413 2.8265 3.7012 4.3781 4.0032 3.5687 5.4432 1.7859 2.5881 2.3969 4.0423 2.9933 4.5847 4.1029 3.2396 2.8264 3.7620 3.2460 3.1887 4.0566 6.8780 4.4468 6.4759 6.0143 3.4538 3.7579 4.5112 4.5788 2.1242 2.0607 1.5037 1.4519 1.4157 1.2539 3.5570 1.6080 5.1824 1.2537 1.3946 4.6167 1.5836 1.3468 2.5785 1.3603 4.2070 1.4248 5.5657 5.9842 1.3486 1.7420 2.1455 2.2614 1.9507 1.5657 1.8560 1.6493 2.2571 1.0577 1.7257 1.1107 1.4802 1.2183 1.4050 2.4178 2.1409 1.8546 2.7107 1.4834 1.3685 2.9663 1.5397 1.6677 2.2563 7.1355 4.0056 1.2205 3.2546 2.7619 2.3021 2.2661 1.0526 1.1671 1.1010 2.2094 1.1264 5.9077 5.9329 6.1905 6.0772 6.7957 1.0576 1.0356 1.1031 1.0615 1.1014 1.0990 1.1025 1.0874 1.0869 1.0863 1.0926 1.0929 1.0966 1.0921 1.0991 1.0967 1.0950 1.1012
irintensity: 0.3975 1.8520 0.3634 1.0641 0.4304 2.4207 0.0388 2.3087 0.5625 2.1091 0.8297 2.4148 1.3310 2.2444 1.3023 0.2645 0.6625 1.1296 0.8905 2.0595 6.3815 2.1884 11.3045 0.4220 0.5626 0.2719 5.5228 25.8681 1.0207 1.6650 1.2126 45.9806 9.7266 62.8128 12.3232 78.1018 15.7773 10.6739 20.4434 21.7105 0.3872 0.7627 24.4330 19.2643 5.5700 28.3440 0.7222 41.4684 1.4721 59.2275 8.7258 0.6241 3.6001 8.0616 11.4707 9.9810 7.3371 3.3514 5.7111 36.9803 3.1668 160.0236 5.7616 36.3637 2.7483 21.3470 56.5120 29.8823 6.4391 94.2445 4.8061 10.9006 32.2173 1.2426 17.1034 0.8047 15.9777 17.3703 17.7502 20.3696 35.5196 13.8916 68.8363 5.6098 14.6589 7.8888 10.2150 39.1085 13.4180 104.7241 0.8585 1.7899 145.7988 29.9902 19.0298 29.1952 34.6455 3.7233 37.0553 34.3306 9.2784 0.9011 7.6839 26.9496 26.2568 34.0398 1.8411 9.9186 11.5464 5.6775 0.7364
temp: 298.150 k
press: 1.00000 atm
elementType: 8 7 7 6 6 6 6 6 6 6 6 6 6 6 6 6 6 6 6 6 6 1 1 1 1 1 1 1 1 1 1 1 1 1 1 1 1 1 1
symmnumber: 1
zpe: 828915.2 jmol-1
zpe.correction: 0.315717 hartree
zpe.thermalcorrener: 0.334297 hartree
zpe.thermalcorrenthalpy: 0.335241 hartree
zpe.thermalcorrgfe: 0.265785 hartree
zpe.sumelectzpe: -879.935460 hartree
zpe.sumelectthermal: -879.916880 hartree
zpe.sumelectthermalent: -879.915936 hartree
zpe.sumelectthermalfe: -879.985393 hartree
dipole: -1.3187 -5.0385 1.5217
dipole: 5.4260
quadrupole: -107.1916 -122.6784 -126.6531
quadrupole: -16.6276 9.3539 1.8855
quadrupole: 11.6494 -3.8373 -7.8121 -16.6276 9.3539 1.8855
hfenergy: -880.251177 hartree
pointgroup: C01 [X(C18H18N2O1)]
dipole: 0.5751593 0.4239267 2.0116266 debye
polarizability: 304.4684726|4.0841645|138.8508834|9.1432839|37.1344323|198.3959983 unknown
InChI: InChI=1S/C18H18N2O/c1-2-20-14-19-12-18(20)16-9-6-10-17(11-16)21-13-15-7-4-3-5-8-15/h3-12,14H,2,13H2,1H3
charge 0 multiplicity 1
39 atoms
O  1.68323 0.150168 0.062617
N  -4.33961 -0.561578 -0.089947
N  -4.494591 -0.902004 -2.335787
C  -3.120817 -0.11053 -0.648273
C  -1.997031 0.480825 0.102411
C  -4.668006 -0.753365 1.339152
C  -0.677071 0.069663 -0.203256
C  -3.252315 -0.335005 -2.029054
C  0.431963 0.647892 0.458764
C  -5.116396 -1.034292 -1.147134
C  -2.189761 1.491078 1.09139
C  -3.896425 -1.930543 1.970284
C  0.238757 1.638364 1.453995
C  -1.080855 2.049586 1.755141
C  2.880445 0.730926 0.694374
C  4.110242 0.109639 0.061699
C  5.290131 -0.0427 0.830905
C  4.1156 -0.2791 -1.300145
C  6.466092 -0.562599 0.244655
C  5.288544 -0.807568 -1.883738
C  6.468376 -0.946638 -1.116056
H  -4.458736 0.176216 1.894002
H  -5.756872 -0.931729 1.397597
H  -0.49635 -0.713701 -0.945549
H  -2.539452 -0.07898 -2.810203
H  -6.10687 -1.459595 -0.997586
H  -3.195131 1.872111 1.298262
H  -4.102044 -2.870608 1.429062
H  -4.201211 -2.060198 3.024557
H  -2.808873 -1.746163 1.946236
H  1.081309 2.088695 1.985843
H  -1.237234 2.829862 2.508322
H  2.864014 0.539922 1.786952
H  2.870075 1.831024 0.53368
H  5.291813 0.241319 1.891066
H  3.196019 -0.182276 -1.885191
H  7.37289 -0.67603 0.849191
H  5.281942 -1.111614 -2.936531
H  7.37741 -1.355675 -1.571011
