program: Gaussian 09
title: 000178633
version: EM64L-G09RevD.01
frameworkgroup: C1[X(C8H17N2O2P)]
method: RPBEPBE
basis: SDD
operation: Freq
keyword: #p
keyword: freq=noraman
keyword: PBEPBE/SDD
title: #p freq=noraman PBEPBE/SDD
converged: YES YES NO NO
title: Mulliken charges:
elementType: P O O N N C C C C C C C C H H H H H H H H H H H H H H H H H
charge: 1.376101 -0.665915 -0.619032 -0.578828 -0.592533 -0.287691 -0.314266 -0.298920 -0.274438 -0.445278 -0.432006 -0.440441 -0.444139 0.234458 0.224751 0.219549 0.252511 0.224539 0.234426 0.234256 0.228214 0.228769 0.217879 0.228169 0.218742 0.225675 0.220603 0.228423 0.220830 0.375592
chargesum: 0.00000
title: Mulliken charges with hydrogens summed into heavy atoms:
elementType: P O O N N C C C C C C C C
charge: 1.376101 -0.290323 -0.619032 -0.578828 -0.592533 0.171518 0.157794 0.160045 0.188032 0.001370 0.014906 0.005837 0.005113
polarizability: 1.43528842e+02 -2.52370162e-01 1.20581482e+02 4.78114834e+00 -1.01191552e+00 1.06862562e+02
1716.lowfreq: -0.0021 -0.0010 0.0004 3.6352 16.4866 20.3434 34.0485 50.0982 51.9820
frequency: 33.4875 49.4986 51.7094 72.5205 119.5204 138.8758 141.7693 197.5500 241.8329 246.4005 263.3419 274.5151 297.7306 309.6135 357.5649 397.8787 445.8146 539.8431 561.1330 564.0416 665.0390 728.4267 743.0048 847.2400 850.9902 863.7434 867.5646 910.6972 911.4181 916.2378 923.6251 958.6718 968.8809 972.8077 1013.5392 1024.2463 1057.5748 1077.9387 1098.2587 1124.7742 1127.7194 1134.0595 1138.7054 1158.6237 1165.5554 1178.6356 1183.8132 1225.6056 1228.5116 1236.3323 1238.1801 1296.4618 1299.6064 1309.8954 1310.5949 1327.4058 1331.3475 1336.8088 1338.8787 1466.2749 1466.4507 1472.6365 1473.5510 1492.5319 1497.8191 1501.2705 1509.0417 2948.8493 2972.3604 2976.6728 2993.9010 3005.8041 3007.3983 3007.9819 3009.2476 3032.0608 3045.4514 3046.4363 3060.0525 3074.1871 3075.3028 3088.7249 3089.9106 3587.2232
redmass: 3.0267 2.8680 2.9428 2.7011 3.1297 3.7131 4.8750 4.0283 2.3118 1.7491 2.2922 4.1545 3.2137 5.1516 1.4256 6.6470 6.5979 7.4290 1.8787 1.8598 9.3579 2.6672 2.3464 1.7020 1.7787 1.9037 1.8545 2.5149 2.2622 1.4397 1.5464 1.9002 1.6940 2.3457 2.0325 2.9050 1.9735 1.7974 1.9159 2.3935 2.2285 2.6994 2.2407 1.4483 1.5923 1.9382 1.7873 1.2393 1.2649 1.3017 1.3034 1.3501 1.3418 1.2492 1.2439 1.3586 1.3583 1.3663 1.3877 1.0894 1.0901 1.0926 1.0931 1.0799 1.0807 1.0867 1.0862 1.0681 1.0610 1.0669 1.0577 1.0653 1.0642 1.0604 1.0678 1.0983 1.1049 1.0940 1.0970 1.1013 1.1016 1.1058 1.1059 1.0656
irintensity: 0.3521 0.8333 0.8581 0.0629 1.0388 0.8638 5.2481 7.0327 10.6512 2.6704 16.9977 9.1985 11.8863 33.3199 77.0216 15.4060 20.8580 103.9569 5.3567 1.6564 138.8046 39.2141 18.8034 2.7467 1.2549 4.0055 5.9685 11.1526 4.8174 1.1920 4.7565 10.1604 1.1879 7.9572 54.7205 153.5467 47.8056 127.5612 66.9403 51.1419 38.1568 31.1543 54.2268 16.6105 11.8002 46.8685 31.3554 3.6511 6.4381 12.4876 9.2231 4.0683 2.5948 0.5360 1.1554 2.8594 6.1029 4.4064 1.5210 11.2403 6.4661 12.6966 6.2026 3.4210 2.0426 5.0028 1.5295 52.4073 71.1727 26.1401 35.8911 25.0734 41.7293 25.3286 35.1920 49.2612 31.3252 20.1144 13.5863 33.9658 25.8285 57.1540 74.6819 40.2532
temp: 298.150 k
press: 1.00000 atm
elementType: 15 8 8 7 7 6 6 6 6 6 6 6 6 1 1 1 1 1 1 1 1 1 1 1 1 1 1 1 1 1
symmnumber: 1
zpe: 665705.1 jmol-1
zpe.correction: 0.253554 hartree
zpe.thermalcorrener: 0.267935 hartree
zpe.thermalcorrenthalpy: 0.268879 hartree
zpe.thermalcorrgfe: 0.211222 hartree
zpe.sumelectzpe: -915.156800 hartree
zpe.sumelectthermal: -915.142419 hartree
zpe.sumelectthermalent: -915.141475 hartree
zpe.sumelectthermalfe: -915.199131 hartree
dipole: -0.2933 -3.2406 1.4777
dipole: 3.5737
quadrupole: -73.4447 -87.4494 -90.9940
quadrupole: -0.6022 -1.3334 7.1428
quadrupole: 10.5180 -3.4867 -7.0313 -0.6022 -1.3334 7.1428
hfenergy: -915.4103538 hartree
pointgroup: C01 [X(C8H17N2O2P1)]
dipole: -0.1373119 -1.3060689 0.5021636 debye
polarizability: 143.2429151|-0.6758805|120.6607469|5.7234831|-0.251112|107.069224 unknown
InChI: InChI=1S/C8H17N2O2P/c11-13(12,9-5-1-2-6-9)10-7-3-4-8-10/h11H,1-8H2
charge 0 multiplicity 1
30 atoms
P  0.018588 1.153594 -0.033874
O  0.107646 1.789426 1.607569
O  -0.095675 2.349966 -1.094471
N  -1.302786 0.060091 -0.166221
N  1.386284 0.115868 0.078519
C  -1.558062 -1.0289 0.819369
C  -2.520125 0.392711 -0.964041
C  1.632232 -0.97132 -0.908113
C  2.629755 0.48711 0.821926
C  -2.962335 -1.548866 0.420086
C  -3.658208 -0.297857 -0.176963
C  2.918149 -1.630054 -0.36077
C  3.717283 -0.421463 0.191385
H  -1.553873 -0.629944 1.853619
H  -0.784428 -1.816558 0.756916
H  -2.434601 -0.023337 -1.987435
H  -2.643209 1.485579 -1.056613
H  1.801924 -0.571737 -1.930738
H  0.773976 -1.665401 -0.949615
H  2.493674 0.284822 1.899787
H  2.871394 1.559894 0.707742
H  -3.503706 -1.97537 1.281802
H  -2.871027 -2.335724 -0.351446
H  -4.518349 -0.550847 -0.820161
H  -4.014935 0.362664 0.635017
H  3.464189 -2.188731 -1.140223
H  2.664099 -2.329007 0.457203
H  4.486647 -0.713594 0.926154
H  4.220245 0.105833 -0.640159
H  -0.173166 2.74015 1.62435
