program: Gaussian 09
title: 000178631
version: EM64L-G09RevD.01
frameworkgroup: C1[X(C9H21OPS3)]
method: RPBEPBE
basis: SDD
operation: Freq
keyword: #p
keyword: freq=noraman
keyword: PBEPBE/SDD
title: #p freq=noraman PBEPBE/SDD
converged: YES YES NO NO
title: Mulliken charges:
elementType: S S S P O C C C C C C C C C H H H H H H H H H H H H H H H H H H H H H
charge: -0.011919 -0.018520 0.022040 0.463129 -0.601413 -0.074705 -0.075600 -0.646164 -0.654834 -0.643686 -0.646171 -0.654073 -0.645102 -0.833132 0.276280 0.205234 0.222895 0.237233 0.232707 0.219387 0.236718 0.208352 0.254438 0.222424 0.203557 0.279495 0.236897 0.232436 0.218781 0.252504 0.208505 0.237746 0.290437 0.278482 0.265641
chargesum: 0.00000
title: Mulliken charges with hydrogens summed into heavy atoms:
elementType: S S S P O C C C C C C C C C
charge: -0.011919 -0.018520 0.022040 0.463129 -0.601413 -0.074705 -0.075600 0.058245 0.034494 0.055823 0.059305 0.034041 0.053652 0.001428
polarizability: 2.47453699e+02 -1.00028461e+00 2.08851808e+02 -1.19547971e+00 1.39729202e-01 1.49312934e+02
1716.lowfreq: -14.7505 -8.8551 -0.0003 0.0012 0.0018 8.3492 23.4114 29.5674 35.6837
frequency: 22.5349 29.0878 35.2837 41.1232 58.0774 82.5706 90.6427 95.7261 101.3919 134.9443 155.1717 167.3419 203.6671 209.1057 215.7929 223.4105 259.2689 265.7296 275.6939 281.2377 282.2068 288.5743 293.8054 306.7154 346.6010 350.2858 360.0532 380.7021 382.9654 401.2412 407.3638 430.0013 443.4187 497.4161 505.5420 639.2326 787.7144 790.1460 928.1101 928.8996 931.3035 932.9063 957.6816 960.0479 965.6180 970.7147 981.9340 1017.2129 1019.8453 1030.7118 1030.7548 1152.4472 1159.9199 1233.5370 1234.6436 1240.1103 1241.0953 1339.0583 1377.3595 1378.3283 1382.6774 1383.3447 1405.0805 1406.3986 1439.1206 1447.1102 1447.7174 1457.8845 1458.4122 1460.0189 1464.2838 1465.0685 1473.7790 1475.4282 1476.6089 1478.2772 1494.0553 1497.4114 2969.3325 2970.9788 2974.3435 2974.7796 2978.4888 2978.9091 3012.5175 3065.6913 3067.3042 3068.5714 3069.4961 3074.4101 3075.0855 3089.6748 3091.5469 3095.8697 3097.9596 3100.4263 3102.2570 3136.8809 3142.9443
redmass: 2.8430 3.0104 3.8824 3.0319 3.9374 1.6381 4.9152 4.5403 2.7757 5.3978 8.5088 4.9060 2.0348 1.4964 1.5881 1.6788 1.1519 1.2109 3.3037 1.3303 1.3975 1.9343 1.3976 4.3536 3.4120 3.4110 5.1674 2.4183 2.4217 3.1031 4.3828 9.8316 13.4505 3.1372 3.1539 7.4684 3.3565 3.3156 1.5882 1.5796 1.5795 1.5460 1.2105 1.2463 3.0921 1.6508 1.1945 1.4454 1.4573 1.4254 1.4337 1.8428 1.8543 2.9623 2.9469 2.9851 2.9618 1.1220 1.1932 1.1956 1.1980 1.2015 1.1935 1.1960 1.0505 1.0461 1.0462 1.0548 1.0487 1.0477 1.0495 1.0498 1.0512 1.0519 1.0517 1.0517 1.0503 1.0506 1.0375 1.0376 1.0365 1.0369 1.0373 1.0372 1.0277 1.0966 1.0960 1.0972 1.0969 1.0967 1.0965 1.1013 1.1011 1.1014 1.1013 1.1006 1.1007 1.1037 1.1065
irintensity: 1.5167 0.2175 0.7044 0.9416 1.3951 0.7269 0.7647 0.6500 1.6001 5.3274 1.7043 5.9510 1.2362 0.6648 0.3758 0.1629 0.0606 0.3038 4.6886 0.0694 0.3400 0.6894 1.7136 9.6736 1.2432 3.6350 0.8342 0.5382 0.4483 27.3900 42.0427 98.7051 140.6904 12.1917 10.9709 1.9335 0.6039 0.6100 0.4134 0.4260 0.5642 0.5795 0.2827 1.7718 40.3343 15.4388 10.4246 7.1902 5.5970 0.1664 0.7125 231.4463 82.6122 5.1527 10.6463 8.5913 9.3296 1.6406 27.7224 29.5718 31.8674 28.6671 15.6484 12.6696 18.2489 1.2977 3.0160 18.3384 6.2829 3.2024 5.2268 6.9561 13.3977 14.4325 12.0333 8.2206 17.5127 22.1781 27.2826 23.1186 16.6912 13.7078 80.8585 34.0337 18.0815 4.2054 7.5215 7.3654 6.0880 61.8764 51.6059 7.3049 10.0406 20.1392 16.4570 14.9766 15.2450 2.7638 6.7940
temp: 298.150 k
press: 1.00000 atm
elementType: 16 16 16 15 8 6 6 6 6 6 6 6 6 6 1 1 1 1 1 1 1 1 1 1 1 1 1 1 1 1 1 1 1 1 1
symmnumber: 1
zpe: 748289.1 jmol-1
zpe.correction: 0.285008 hartree
zpe.thermalcorrener: 0.307190 hartree
zpe.thermalcorrenthalpy: 0.308134 hartree
zpe.thermalcorrgfe: 0.232367 hartree
zpe.sumelectzpe: -1965.036171 hartree
zpe.sumelectthermal: -1965.013989 hartree
zpe.sumelectthermalent: -1965.013045 hartree
zpe.sumelectthermalfe: -1965.088812 hartree
dipole: -0.2123 -1.1293 0.9411
dipole: 1.4853
quadrupole: -102.4793 -109.8772 -126.9965
quadrupole: -1.1691 -0.1972 2.4097
quadrupole: 10.6384 3.2404 -13.8788 -1.1691 -0.1972 2.4097
hfenergy: -1965.3211794 hartree
pointgroup: C01 [X(C9H21O1P1S3)]
dipole: 0.0921318 0.3736151 0.4397694 debye
polarizability: 245.2434158|-6.9539341|208.6772536|11.0557884|7.3397343|151.6977726 unknown
InChI: InChI=1S/2C4H9S.CH3S.OP/c2*1-4(2,3)5;2*1-2/h2*1-3H3;1H3;
charge 0 multiplicity 1
35 atoms
S  -1.254115 0.901283 -1.419605
S  2.027629 -0.578684 -1.123446
S  -0.82073 -2.670574 -1.351133
P  -0.107288 -0.735796 -0.314624
O  -0.256178 -0.76493 1.286621
C  -2.854959 1.138793 -0.301371
C  2.924742 0.531951 0.224076
C  -2.436977 1.774753 1.038552
C  -3.701604 2.107646 -1.158635
C  -3.567175 -0.212023 -0.105419
C  3.041855 -0.267547 1.536344
C  4.306836 0.775003 -0.425258
C  2.151599 1.850396 0.413689
C  0.053746 -3.869194 -0.174648
H  -1.782626 1.096378 1.612643
H  -3.345021 1.976263 1.640999
H  -1.908532 2.73053 0.877021
H  -3.985252 1.654296 -2.124578
H  -3.165958 3.053537 -1.354805
H  -4.628664 2.34992 -0.60372
H  -3.784553 -0.699848 -1.070752
H  -4.525775 -0.036687 0.421543
H  -2.965857 -0.902997 0.510242
H  3.584939 -1.215367 1.376849
H  3.60434 0.334661 2.277487
H  2.046037 -0.494976 1.954199
H  4.217925 1.329323 -1.375957
H  4.838741 -0.173892 -0.617433
H  4.923343 1.376287 0.270736
H  1.165221 1.679056 0.878702
H  2.731757 2.512158 1.086642
H  2.001583 2.372605 -0.546481
H  -0.221851 -3.632375 0.863694
H  1.142537 -3.803743 -0.316678
H  -0.309617 -4.873105 -0.445195
