program: Gaussian 09
title: 000012897
version: EM64L-G09RevD.01
frameworkgroup: C1[X(C14H16N2O3)]
method: RPBEPBE
basis: SDD
operation: Freq
keyword: #p
keyword: freq=noraman
keyword: PBEPBE/SDD
title: #p freq=noraman PBEPBE/SDD
converged: YES YES NO NO
title: Mulliken charges:
elementType: O O O N N C C C C C C C C C C C C C C H H H H H H H H H H H H H H H H
charge: -0.220222 -0.236707 -0.241239 -0.183754 -0.189316 0.006181 -0.380005 0.402703 0.115384 0.163829 -0.722730 0.221023 -0.378025 -0.385317 -0.598492 -0.600215 -0.236790 -0.238196 -0.240905 0.236464 0.234895 0.234966 0.234189 0.222557 0.258264 0.278554 0.254924 0.270672 0.249046 0.257259 0.251322 0.266826 0.229738 0.230334 0.232782
chargesum: 0.00000
title: Mulliken charges with hydrogens summed into heavy atoms:
elementType: O O O N N C C C C C C C C C C C C C C
charge: -0.220222 -0.236707 -0.241239 -0.183754 -0.189316 0.006181 0.091354 0.402703 0.115384 0.163829 -0.031018 0.221023 -0.119762 -0.106763 0.176151 0.175191 -0.007052 -0.007863 -0.008123
polarizability: 1.82923734e+02 -1.80975285e+00 1.71020267e+02 -3.60950101e+00 1.38256794e+00 1.47792408e+02
1716.lowfreq: -13.4696 -6.6307 -0.0004 0.0001 0.0003 6.6274 14.3826 34.7013 59.2451
frequency: 12.6658 34.5331 59.2130 78.6298 82.4041 91.5309 112.6759 117.0960 151.5400 174.6179 201.6042 204.5988 252.5392 272.6841 301.3288 304.1759 313.6037 321.8900 362.7631 384.5632 393.2864 401.8004 437.0307 449.2480 504.1809 519.5722 585.3624 614.5659 648.9964 685.0127 700.4627 703.5163 715.8532 722.9569 765.2143 787.2294 840.9871 857.0395 915.1117 917.2074 935.1835 968.9942 984.6471 989.8788 1000.8746 1006.8274 1031.6773 1055.5224 1070.3032 1086.1189 1093.6345 1129.1334 1129.8077 1144.1455 1162.6714 1169.6010 1177.1157 1208.0596 1234.4720 1255.0765 1296.3443 1323.9879 1330.4315 1341.3358 1349.9307 1376.2139 1390.0020 1423.9839 1431.8007 1436.4328 1447.1891 1472.6601 1473.9248 1480.3551 1480.7446 1481.2096 1483.2306 1485.8319 1583.3942 1589.7009 1591.7982 1605.7270 1648.6947 2988.0378 3017.9919 3019.7045 3024.4835 3074.9831 3082.4121 3099.7750 3108.7493 3113.7824 3127.4848 3135.5823 3147.5190 3148.3975 3151.2840 3156.0170 3167.9273
redmass: 3.8285 6.2639 3.1373 1.1191 1.0452 3.3777 2.7383 3.2915 8.3495 7.3518 1.3897 3.5534 5.1940 3.1525 2.2594 3.6996 3.2122 3.9711 4.3230 6.7930 7.8773 2.8651 5.6635 11.1433 4.0904 4.3577 5.7912 6.4247 8.7659 4.2539 7.3822 1.9352 9.8437 2.9787 1.7530 1.8427 3.7109 1.2461 2.7861 3.2411 1.8099 1.9393 1.4140 5.1743 1.3289 3.3614 2.4911 2.6252 2.1339 2.2035 1.6404 1.3097 1.3159 3.6102 2.9585 3.1207 1.0957 1.1335 4.1375 3.1368 1.2491 1.8512 1.4281 2.5768 3.7455 6.3221 1.2123 1.2176 1.4609 1.8858 1.0903 1.0597 1.0491 1.0973 1.3272 1.4439 1.0723 1.0440 9.3337 6.1068 9.7012 5.8503 9.5192 1.0355 1.0335 1.0330 1.0604 1.1010 1.0981 1.1033 1.1023 1.1025 1.0849 1.0881 1.0928 1.1023 1.1019 1.0953 1.1013
irintensity: 0.0822 0.7566 0.2134 0.0131 0.4139 0.2774 3.0736 8.0708 0.1505 7.3211 0.7289 0.1926 2.1728 0.9527 0.7313 0.2477 7.0899 0.2956 1.8489 34.0937 20.2704 0.2092 13.0424 1.7214 19.9224 8.8824 11.2239 0.0422 1.6615 2.3354 0.1655 41.9428 14.4808 2.9471 49.4729 1.9116 9.6009 0.1989 3.1914 6.8713 4.8980 21.9032 0.0262 2.2294 0.1949 0.3367 15.2348 40.2715 76.4894 3.6075 2.8151 0.2262 0.0402 4.1581 13.3649 11.9074 0.2728 6.5445 40.8243 14.8477 13.6429 76.7773 30.7349 142.2292 136.0474 0.1481 19.0275 74.6501 163.8415 12.9491 38.5288 20.4601 10.6045 10.6141 43.5248 19.8416 7.7988 17.0479 152.3247 28.6486 564.8987 20.2580 24.5480 29.1216 22.6118 21.6634 13.1127 2.3601 34.6645 20.2664 14.0481 13.5871 0.1355 6.9922 6.8986 0.8295 0.4856 17.0577 24.6652
temp: 298.150 k
press: 1.00000 atm
elementType: 8 8 8 7 7 6 6 6 6 6 6 6 6 6 6 6 6 6 6 1 1 1 1 1 1 1 1 1 1 1 1 1 1 1 1
symmnumber: 1
zpe: 729256.1 jmol-1
zpe.correction: 0.277759 hartree
zpe.thermalcorrener: 0.296193 hartree
zpe.thermalcorrenthalpy: 0.297137 hartree
zpe.thermalcorrgfe: 0.229877 hartree
zpe.sumelectzpe: -876.914752 hartree
zpe.sumelectthermal: -876.896318 hartree
zpe.sumelectthermalent: -876.895374 hartree
zpe.sumelectthermalfe: -876.962633 hartree
dipole: 0.8080 0.2105 -0.9342
dipole: 1.2530
quadrupole: -105.3008 -110.5048 -117.5648
quadrupole: 1.1061 -7.0256 0.1722
quadrupole: 5.8227 0.6187 -6.4414 1.1061 -7.0256 0.1722
hfenergy: -877.1925107 hartree
pointgroup: C01 [X(C14H16N2O3)]
dipole: 0.347194 0.3338382 0.1049374 debye
polarizability: 183.1421198|1.0863678|147.9087805|-2.1790687|-3.5076432|170.685509 unknown
InChI: InChI=1S/C14H16N2O3/c1-4-14(10-8-6-5-7-9-10)11(17)15(2)13(19)16(3)12(14)18/h5-9H,4H2,1-3H3
charge 0 multiplicity 1
35 atoms
O  -0.697299 -1.834427 1.839035
O  -0.540039 -0.146897 -2.609124
O  -2.660214 2.248571 0.767703
N  -1.633185 0.217022 1.329348
N  -1.535448 1.092895 -0.913061
C  -0.036099 -0.836705 -0.307045
C  0.189452 -2.285733 -0.848466
C  1.361519 -0.180518 -0.027386
C  -0.820984 -0.890138 1.013221
C  -0.733897 0.025435 -1.375858
C  -1.107278 -3.050964 -1.181867
C  -1.965971 1.256697 0.424254
C  1.908717 -0.132542 1.279961
C  2.13838 0.300134 -1.114142
C  -2.225506 0.263372 2.688958
C  -2.030793 2.101144 -1.882983
C  3.199375 0.40099 1.495985
C  3.42772 0.830541 -0.893482
C  3.963891 0.887595 0.412978
H  0.763529 -2.831035 -0.078983
H  0.821057 -2.202214 -1.749817
H  -1.744404 -3.173171 -0.288074
H  -1.685539 -2.540715 -1.972607
H  -0.860352 -4.062016 -1.552263
H  1.347931 -0.529232 2.132061
H  1.739091 0.255502 -2.133023
H  -2.897141 -0.598056 2.835689
H  -2.782077 1.205702 2.783735
H  -1.424108 0.211063 3.44323
H  -1.703127 3.105542 -1.571965
H  -3.13201 2.087142 -1.92001
H  -1.615772 1.841277 -2.866765
H  3.606911 0.429708 2.512659
H  4.012664 1.196965 -1.74439
H  4.964005 1.300967 0.583394
