program: Gaussian 09
title: 000178664
version: EM64L-G09RevD.01
frameworkgroup: C1[X(C8H19OPS3)]
method: RPBEPBE
basis: SDD
operation: Freq
keyword: #p
keyword: freq=noraman
keyword: PBEPBE/SDD
title: #p freq=noraman PBEPBE/SDD
converged: YES YES NO NO
title: Mulliken charges:
elementType: S S S P O C C C C C C C C H H H H H H H H H H H H H H H H H H H
charge: 0.082506 0.011196 -0.243008 0.356488 -0.614776 -0.263812 -0.254690 -0.741897 -0.729614 -0.341260 -0.341015 -0.687828 -0.687316 0.212794 0.212795 0.205637 0.209437 0.280669 0.294959 0.289889 0.275330 0.203231 0.195084 0.193826 0.204673 0.220099 0.210091 0.213371 0.220749 0.211578 0.210479 0.390333
chargesum: 0.00000
title: Mulliken charges with hydrogens summed into heavy atoms:
elementType: S S S P O C C C C C C C C
charge: 0.082506 0.011196 -0.243008 0.356488 -0.224443 0.161777 0.160384 -0.166268 -0.164395 0.057055 0.057484 -0.044267 -0.044509
polarizability: 1.87326046e+02 1.18074783e+01 1.90136345e+02 -8.33077006e+00 3.71658286e+00 1.55250679e+02
1716.lowfreq: -12.5728 -9.2388 -8.1210 -0.0012 -0.0007 0.0006 12.2003 16.8019 30.9756
frequency: 7.2329 13.2065 30.6332 38.9675 59.2964 71.6122 93.5006 99.0407 118.4843 144.7419 150.6371 154.9176 164.5412 192.9694 209.1866 224.2057 228.2110 239.4766 252.0012 275.2417 330.2644 332.7164 342.3389 379.8962 381.3952 416.4334 550.6895 667.4967 668.2503 696.0385 721.0572 724.6952 763.6474 769.9713 891.9973 892.8591 902.5785 905.7244 1026.6984 1027.4236 1037.7397 1072.0784 1072.9219 1073.7114 1079.8564 1102.3079 1102.9273 1204.4478 1206.5744 1242.8074 1245.6605 1274.3210 1276.5368 1285.0344 1289.6302 1303.0647 1306.7952 1342.4762 1346.6928 1389.3828 1393.1661 1425.9352 1434.9886 1461.8199 1467.4073 1473.8391 1474.8113 1476.2967 1477.3571 1485.6780 1487.2615 2970.8623 2971.1217 2973.6502 2973.7332 2984.2779 2989.2230 2992.7879 2999.6382 3014.5239 3015.2734 3044.6130 3045.5973 3067.9259 3068.7513 3075.5330 3076.1025 3076.8701 3079.6521 3543.4931
redmass: 4.1073 4.4499 4.8818 4.2718 1.7007 1.6022 2.5868 5.1846 2.7433 3.5216 4.4333 4.3676 3.0776 2.9990 4.8083 1.6725 1.3845 1.8627 2.8832 1.7517 11.1038 5.5627 5.6977 2.8077 2.8144 12.0135 21.4731 6.0378 6.1621 13.3389 1.0955 1.0993 1.1640 1.1753 1.8069 1.8039 1.2198 1.2240 3.8537 3.8548 1.1343 2.3439 2.1504 1.3126 1.2769 2.2427 2.2495 1.4572 1.4602 1.2169 1.2171 1.2001 1.1955 1.0620 1.0601 1.2761 1.2821 1.5309 1.5217 1.2097 1.2092 1.0842 1.0844 1.0770 1.0769 1.0573 1.0571 1.0443 1.0440 1.0801 1.0800 1.0556 1.0559 1.0400 1.0395 1.0604 1.0603 1.0587 1.0587 1.1001 1.0999 1.1025 1.1023 1.1011 1.1015 1.1004 1.0999 1.1028 1.1044 1.0660
irintensity: 0.1639 0.0075 0.4022 0.1261 0.2007 0.4329 0.4265 1.3507 0.1885 5.1875 6.6223 0.8220 9.0860 7.9024 8.0775 1.7294 2.7003 2.8395 1.4397 68.1159 31.3847 7.2416 1.9677 0.5766 3.3487 130.9502 93.6161 3.5610 29.0688 126.8962 13.3807 10.1352 0.8725 0.4387 4.0596 6.5843 4.2258 2.4607 0.6909 7.9215 115.8348 0.9915 2.4025 1.4626 1.3555 6.1783 12.1415 1.5564 0.2492 9.3726 1.1402 0.5296 0.2023 0.3476 1.0074 9.9585 9.0066 1.4618 2.5546 4.9167 12.3076 17.4028 14.1657 2.6849 0.2183 1.4188 4.7710 12.8636 12.3527 16.3064 13.2832 30.8565 26.8085 10.9686 32.7775 5.2105 11.3110 56.7270 29.1404 2.3870 2.1601 14.7724 10.3387 90.7346 29.4170 36.8279 51.6803 36.1209 26.3076 55.6474
temp: 298.150 k
press: 1.00000 atm
elementType: 16 16 16 15 8 6 6 6 6 6 6 6 6 1 1 1 1 1 1 1 1 1 1 1 1 1 1 1 1 1 1 1
symmnumber: 1
zpe: 684487.9 jmol-1
zpe.correction: 0.260708 hartree
zpe.thermalcorrener: 0.280774 hartree
zpe.thermalcorrenthalpy: 0.281719 hartree
zpe.thermalcorrgfe: 0.207269 hartree
zpe.sumelectzpe: -1925.812472 hartree
zpe.sumelectthermal: -1925.792405 hartree
zpe.sumelectthermalent: -1925.791461 hartree
zpe.sumelectthermalfe: -1925.865911 hartree
dipole: -3.2147 -0.2989 -0.3957
dipole: 3.2527
quadrupole: -117.1507 -97.7367 -120.5344
quadrupole: -1.7416 -0.2096 0.8389
quadrupole: -5.3434 14.0706 -8.7271 -1.7416 -0.2096 0.8389
hfenergy: -1926.0731798 hartree
pointgroup: C01 [X(C8H19O1P1S3)]
dipole: -0.596595 0.1825952 1.1173142 debye
polarizability: 198.1411668|-0.9513924|154.9822792|-7.3701345|-8.6198342|179.5896241 unknown
InChI: InChI=1S/C4H10OPS2.C4H9S/c1-2-3-4-8-6(5)7;1-2-3-4-5/h5H,2-4H2,1H3;2-4H2,1H3
charge 0 multiplicity 1
32 atoms
S  2.3712 0.732938 -3.014581
S  -1.318605 1.470812 -2.696447
S  -0.084828 -2.005277 -2.53545
P  0.279928 -0.103088 -3.287745
O  0.292895 0.134679 -5.017665
C  2.312679 0.5611 -0.139906
C  -2.036037 0.641876 -0.038409
C  2.807606 -0.166569 -1.397004
C  -2.393988 0.438414 -1.51665
C  2.687909 -0.205872 1.151864
C  -2.978401 -0.158586 0.893971
C  2.16097 0.496799 2.422038
C  -2.607175 0.014514 2.382952
H  2.736662 1.583364 -0.105373
H  1.212809 0.678576 -0.189623
H  -0.992113 0.314936 0.132416
H  -2.083392 1.717913 0.219279
H  3.909847 -0.234882 -1.434434
H  2.391231 -1.188128 -1.477401
H  -2.276188 -0.620093 -1.818163
H  -3.425392 0.761377 -1.745924
H  2.278491 -1.234813 1.0999
H  3.790325 -0.308184 1.214478
H  -4.025503 0.169029 0.732192
H  -2.937625 -1.232631 0.623099
H  2.440517 -0.060483 3.334613
H  1.057418 0.579368 2.400577
H  2.571495 1.520009 2.51078
H  -3.284903 -0.564952 3.035819
H  -2.668788 1.076105 2.687715
H  -1.574174 -0.332343 2.575845
H  -0.620069 0.119794 -5.412363
