program: Gaussian 09
title: 000178621
version: EM64L-G09RevD.01
frameworkgroup: C1[X(C6H13N2OPS)]
method: RPBEPBE
basis: SDD
operation: Freq
keyword: #p
keyword: freq=noraman
keyword: PBEPBE/SDD
title: #p freq=noraman PBEPBE/SDD
converged: YES YES NO NO
title: Mulliken charges:
elementType: S P O N N C C C C C C H H H H H H H H H H H H H
charge: -0.009766 1.032313 -0.587840 -0.504972 -0.702156 -0.295351 -0.338304 -0.439487 -0.427267 -0.288482 -0.639035 0.228463 0.235236 0.225327 0.262259 0.231403 0.219480 0.230923 0.223480 0.344332 0.240459 0.227893 0.264348 0.266740
chargesum: 0.00000
title: Mulliken charges with hydrogens summed into heavy atoms:
elementType: S P O N N C C C C C C
charge: -0.009766 1.032313 -0.587840 -0.504972 -0.357824 0.168348 0.149282 0.011397 0.027136 0.179870 -0.107946
polarizability: 1.47202319e+02 -1.27846767e+01 1.12587622e+02 3.03995114e+00 1.08438771e-01 1.03383013e+02
1716.lowfreq: -12.6415 -0.0019 0.0018 0.0024 5.3504 14.8043 46.3166 54.5194 78.3332
frequency: 45.5718 54.3265 78.2368 111.0101 154.1385 199.8406 231.5560 232.8556 259.8460 286.0001 314.2214 331.5827 383.1242 419.5263 471.2854 558.2526 564.3470 626.6969 715.6102 751.8241 847.4805 865.2834 865.6398 911.4053 913.4898 949.4709 960.1123 997.0512 1010.6357 1027.4486 1068.2437 1105.2930 1118.4512 1125.7077 1150.5992 1162.6673 1185.7129 1192.2761 1222.0501 1239.6512 1277.5473 1295.9265 1310.2389 1310.8116 1325.8404 1332.3950 1368.1950 1435.8429 1465.9992 1467.3737 1472.1017 1492.5938 1498.2777 2956.6144 2959.8399 2984.0377 3008.4891 3010.3964 3029.7251 3044.5217 3048.1123 3067.4612 3076.6064 3091.4057 3115.9124 3574.7276
redmass: 3.0294 3.4257 3.0578 4.4101 3.8074 3.4271 3.3115 2.6343 2.3452 2.9534 4.0975 1.9224 11.1053 4.3793 5.8975 2.4184 2.6751 4.1817 2.9034 3.3789 1.7467 1.9148 1.7717 2.5529 1.4545 2.2862 1.7415 4.8726 1.4665 4.9854 1.7913 3.1584 3.5835 2.2125 1.3241 1.2138 1.6715 1.2673 1.2765 1.2795 1.2039 1.3341 1.2169 1.2310 1.3414 1.3746 1.3391 1.0962 1.0897 1.0804 1.0912 1.0771 1.0849 1.0666 1.0642 1.0669 1.0623 1.0638 1.0693 1.0858 1.0952 1.0975 1.1017 1.1060 1.1095 1.0771
irintensity: 1.0022 1.3530 0.9461 8.3419 4.2822 4.6625 10.5347 4.0286 2.5869 3.3061 8.6860 91.2172 44.5544 35.7509 41.0543 18.0744 48.3020 3.5323 28.3148 63.2911 1.0470 5.7398 5.3314 8.8879 2.7993 9.7843 5.4474 110.7338 7.1079 91.8019 74.1457 55.8914 19.3503 19.9938 5.6209 3.4508 20.7081 10.6653 1.9558 10.5516 11.2685 2.3408 38.6708 13.8456 2.4646 13.6654 9.5874 6.6654 10.4804 3.0655 9.9041 5.1294 4.1373 24.5399 80.9138 47.5161 29.3162 29.2505 11.1836 31.5382 43.1048 9.7323 24.1683 57.6184 15.8498 30.6786
temp: 298.150 k
press: 1.00000 atm
elementType: 16 15 8 7 7 6 6 6 6 6 6 1 1 1 1 1 1 1 1 1 1 1 1 1
symmnumber: 1
zpe: 512776.4 jmol-1
zpe.correction: 0.195306 hartree
zpe.thermalcorrener: 0.207585 hartree
zpe.thermalcorrenthalpy: 0.208530 hartree
zpe.thermalcorrgfe: 0.156067 hartree
zpe.sumelectzpe: -1159.555090 hartree
zpe.sumelectthermal: -1159.542811 hartree
zpe.sumelectthermalent: -1159.541866 hartree
zpe.sumelectthermalfe: -1159.594329 hartree
dipole: -0.9143 -4.2760 -3.2944
dipole: 5.4748
quadrupole: -68.4691 -90.9998 -80.2867
quadrupole: -3.8481 -6.4964 -1.2600
quadrupole: 11.4495 -11.0813 -0.3682 -3.8481 -6.4964 -1.2600
hfenergy: -1159.750396 hartree
pointgroup: C01 [X(C6H13N2O1P1S1)]
dipole: 0.5132345 -1.8257829 -1.0210697 debye
dipolederiv: -0.5358535 0.0168413 -0.1402561 0.0908957 -0.2440206 0.0735941 -0.3157403 0.0746081 -0.5609936 2.2519647 -0.0218058 0.1287383 -0.1000353 1.2447563 -0.1087028 0.3471116 0.024412 1.5376374 -0.7379371 -0.0094448 -0.0250355 -0.0173598 -0.5707586 -0.0733285 -0.0134858 -0.1198963 -0.7715741 -1.2591152 0.0833009 -0.0159603 0.0312739 -0.5352455 -0.0757341 0.1274287 -0.1191163 -0.6408265 -0.9500577 -0.0241777 0.0238741 -0.0726514 -0.7183859 0.0015403 -0.0680141 -0.0534727 -0.6851862 0.0969138 -0.0269134 -0.0075068 -0.1807609 0.3174146 0.0204633 -0.2482932 0.1110165 0.3416623 0.518123 0.0271112 0.1967639 0.3084564 0.1433306 -0.0449669 0.2115056 -0.0091874 0.2339691 0.0517964 -0.057416 -0.0045517 -0.0511638 0.0706024 -0.0573696 0.0628205 -0.0779084 0.1029576 0.0175838 -0.0540665 0.0653005 0.013192 0.0687887 -0.0235054 0.017239 -0.0565714 0.0133648 0.5642584 -0.00103 0.0362807 -0.2340418 0.0791006 0.0380377 0.0519882 0.010832 0.2325984 0.1291024 0.0476396 0.0329621 0.1955502 0.2113947 0.2005791 0.0256271 0.1005543 0.032205 0.0413498 0.0207488 -0.0874386 0.044348 0.0110496 0.0676211 -0.0040405 -0.0038475 -0.0762978 0.0066992 -0.0740737 -0.0111829 -0.023589 -0.1461803 -0.0483741 0.0450471 -0.0208171 0.0387452 -0.1262715 0.0217922 -0.1068926 -0.0022763 0.0141234 0.1124894 -0.1165283 0.070939 -0.0909863 0.0851253 0.0698496 0.0392489 -0.0087092 -0.0237013 -0.0570652 -0.0111526 -0.0551078 0.0396938 0.013442 0.0162336 0.0648657 0.00498 0.0785475 -0.0038676 0.12225 -0.0331249 -0.1354832 -0.0207182 0.0651471 -0.0291854 0.0837876 -0.0876493 0.0532441 -0.091026 0.0970644 0.031167 -0.1868785 -0.0528502 -0.0637508 -0.0387714 0.077688 -0.007976 -0.0689387 -0.0212672 0.0652929 0.0804895 0.068312 -0.0290881 0.0192437 -0.0822087 0.078632 0.0138996 0.0960212 -0.0245689 0.1969849 -0.0912675 -0.0601367 -0.0293164 0.1881359 0.0785605 -0.1209408 0.0576868 0.2138259 -0.1654522 0.0167664 0.0471479 0.1519711 0.0537119 -0.0483938 0.0753885 -0.0271443 -0.0189912 0.0057325 -0.0659879 -0.028258 -0.121972 -0.1289221 -0.0280404 -0.0016514 -0.0023879 0.0936117 0.0136351 0.0249202 0.0839874 -0.0271145 -0.0834153 -0.1267816 0.046546 -0.0515635 -0.0216629 -0.0909169 0.0003707 -0.109926 -0.0359368 0.0618433 -0.0206555 -0.0870401 0.0082785 0.0498396 unknown
polarizability: 144.3375458|2.9759385|104.9500824|15.9767082|4.000474|113.8853264 unknown
InChI: InChI=1S/C6H13N2OPS/c9-10(7-3-6-11)8-4-1-2-5-8/h7H,1-6H2
charge 0 multiplicity 1
24 atoms
S  -1.716545 1.412351 -1.202107
P  -0.683629 0.49256 0.72125
O  -0.762603 1.40106 2.038364
N  0.93927 -0.028558 0.413817
N  -1.607147 -0.974812 0.54788
C  1.309397 -0.688347 -0.874731
C  2.102591 0.704863 1.003672
C  2.846209 -0.498989 -0.95834
C  3.09991 0.813479 -0.171832
C  -2.885885 -0.931884 -0.181242
C  -2.662082 -0.206578 -1.525176
H  0.794933 -0.185146 -1.720569
H  1.013329 -1.751512 -0.873539
H  2.530041 0.109822 1.834303
H  1.782444 1.676918 1.416227
H  3.195744 -0.452211 -2.003639
H  3.360595 -1.342801 -0.462684
H  4.143885 0.911493 0.171277
H  2.85679 1.690855 -0.799032
H  -1.439752 -1.739493 1.203365
H  -3.685914 -0.417523 0.391358
H  -3.211499 -1.970951 -0.374354
H  -2.068285 -0.826404 -2.215609
H  -3.621998 0.075709 -1.986758
