program: Gaussian 09
title: 000178612
version: EM64L-G09RevD.01
frameworkgroup: C1[X(C6H15N2OPS)]
method: RPBEPBE
basis: SDD
operation: Freq
keyword: #p
keyword: freq=noraman
keyword: PBEPBE/SDD
title: #p freq=noraman PBEPBE/SDD
converged: YES YES NO NO
title: Mulliken charges:
elementType: S P O N N C C C C C C H H H H H H H H H H H H H H H
charge: -0.243395 0.825920 -0.450609 -0.433926 -0.431725 -0.351246 -0.350085 -0.351994 -0.587040 -0.588248 -0.481133 0.223825 0.199426 0.215294 0.229076 0.229163 0.216252 0.225797 0.235731 0.254241 0.226340 0.254059 0.235519 0.233685 0.232579 0.232492
chargesum: 0.00000
title: Mulliken charges with hydrogens summed into heavy atoms:
elementType: S P O N N C C C C C C
charge: -0.243395 0.825920 -0.450609 -0.433926 -0.431725 0.072006 0.094285 0.093422 0.128730 0.127670 0.217623
polarizability: 1.24516079e+02 -3.65951344e-02 1.17066718e+02 -1.14283578e+01 6.12927814e-02 1.19474420e+02
1716.lowfreq: -5.2179 -0.0022 -0.0022 0.0022 14.7223 16.2928 43.7796 90.7013 102.3018
frequency: 43.7591 90.5870 102.2733 105.7960 121.1398 125.8455 143.4264 179.3134 183.5400 205.2102 254.5787 278.4720 287.3243 322.1228 347.9921 383.1754 393.0492 410.3829 487.7563 532.5763 642.1950 649.2228 653.6234 832.2335 885.8322 920.1045 933.8572 949.7745 1031.3635 1058.9211 1082.6867 1102.6246 1111.0362 1121.4008 1125.7349 1129.3973 1146.7465 1168.9953 1200.4398 1212.8600 1268.1703 1270.7780 1348.1621 1360.1864 1371.5677 1410.0042 1432.3291 1434.7240 1443.7026 1446.1602 1461.8885 1462.6925 1469.1848 1473.4154 1479.7216 1483.1386 1488.8914 2904.6119 2908.3550 2944.5576 2945.5894 2979.1200 2999.3988 3018.1573 3025.7360 3041.6643 3042.3115 3070.0319 3078.9154 3094.3881 3095.1767 3117.6145
redmass: 3.7383 3.2267 1.9985 1.1531 2.7669 2.9496 3.7295 1.1819 1.1768 3.9839 2.9000 2.7533 4.2591 3.4151 2.8568 6.0994 3.1595 5.1477 5.2764 1.9487 6.9337 7.3741 11.0433 2.3181 1.4364 2.6763 2.0996 11.2597 1.9814 3.3171 1.6520 1.2908 1.2407 1.3136 1.4867 1.6041 4.1370 2.2889 1.2606 2.6143 1.4431 1.1666 1.3494 1.4378 1.3805 1.1203 1.1374 1.1442 1.0896 1.0537 1.0513 1.0493 1.0672 1.0561 1.0579 1.0536 1.0721 1.0694 1.0687 1.0412 1.0414 1.0285 1.0649 1.0910 1.0880 1.0931 1.0929 1.1026 1.1046 1.1001 1.1001 1.1037
irintensity: 3.0493 3.3171 0.2057 0.1533 3.5468 0.0707 0.0347 0.1259 0.7762 19.2705 0.1492 12.6917 0.9745 6.5964 1.8321 5.6626 6.0544 0.1564 9.4533 0.4359 44.5325 75.5682 155.6621 39.2904 24.3328 9.9935 37.3346 142.5680 49.7035 76.9184 8.3805 0.3452 0.0502 1.4881 0.4433 14.3299 31.1275 5.9834 3.5419 58.0345 6.9469 6.9631 0.5491 0.0045 8.5606 3.5365 9.8630 10.1843 14.6784 9.7368 12.4119 15.5710 0.1999 26.6088 7.6207 15.5556 9.2941 17.2835 117.3772 116.9663 20.1846 51.8458 12.3253 39.5142 53.6029 16.0316 35.7995 35.6733 33.8775 9.8178 15.1010 17.7344
temp: 298.150 k
press: 1.00000 atm
elementType: 16 15 8 7 7 6 6 6 6 6 6 1 1 1 1 1 1 1 1 1 1 1 1 1 1 1
symmnumber: 1
zpe: 564205.0 jmol-1
zpe.correction: 0.214894 hartree
zpe.thermalcorrener: 0.229122 hartree
zpe.thermalcorrenthalpy: 0.230066 hartree
zpe.thermalcorrgfe: 0.174070 hartree
zpe.sumelectzpe: -1160.714221 hartree
zpe.sumelectthermal: -1160.699993 hartree
zpe.sumelectthermalent: -1160.699049 hartree
zpe.sumelectthermalfe: -1160.755046 hartree
dipole: -5.4320 0.0389 2.1288
dipole: 5.8343
quadrupole: -87.5461 -73.8574 -83.4250
quadrupole: 0.1062 5.7935 -0.0192
quadrupole: -5.9366 7.7521 -1.8155 0.1062 5.7935 -0.0192
hfenergy: -1160.9291155 hartree
pointgroup: C01 [X(C6H15N2O1P1S1)]
dipole: 0.3743899 1.6566096 1.5441304 debye
dipolederiv: -0.4845563 -0.0002466 -0.021786 -0.0045635 -0.5197955 -0.1304194 -0.0476376 -0.2326233 -0.820531 1.4684795 -0.0087158 -0.0580189 0.0080287 1.4689987 -0.1614572 0.0550063 0.2890541 1.9992196 -0.5227149 -0.0255601 0.0806522 -0.0253278 -0.5748494 0.2317103 0.0954837 0.2622811 -1.2638154 -0.8728545 -0.0612871 0.0548305 -0.019933 -0.8507043 -0.0327014 -0.0185936 -0.1085133 -0.6138144 -0.8279345 0.0556391 -0.0770333 0.0068392 -0.8891496 0.0027129 -0.0469415 -0.0958591 -0.619874 0.0179298 0.0049617 -0.0170172 0.0065518 0.0333402 -0.0517288 -0.0064091 -0.0087221 0.1055771 0.0859892 0.0627541 -0.0111543 0.2771546 0.6127491 0.0324955 -0.086368 -0.0981071 0.2393958 0.0626538 0.2508972 0.0087835 0.0258005 0.623542 0.0175019 0.0161241 -0.1213041 0.2434104 0.3917219 -0.0946084 -0.0192955 -0.2851429 0.0850065 -0.0258207 -0.1580291 -0.0135721 0.2334256 0.4754082 -0.1173918 0.0209738 0.0720871 -0.0064562 -0.0232375 0.1438961 -0.0894655 0.244493 0.2706862 -0.0287431 0.0312767 -0.0417927 0.1522876 0.1712499 -0.0618511 -0.1811676 0.6047694 0.021763 0.0205058 0.0305784 0.0174232 0.0994897 0.0943273 0.0106358 0.017684 -0.1242822 0.0348272 -0.0620248 -0.0083151 -0.0596779 -0.1835262 -0.0254804 0.0051897 0.0265956 0.0939609 0.0549883 -0.0118212 0.0323908 -0.0370618 -0.081863 0.0185631 0.1219699 0.1454767 -0.1420688 -0.1368517 -0.0672374 -0.0987273 -0.0395444 0.0091877 -0.0150462 -0.1053001 -0.0152387 0.0306688 -0.0682801 0.1095597 0.0679251 0.0828684 -0.0713856 -0.0514858 0.074475 -0.0534669 0.0461327 0.0462607 -0.072671 -0.0035947 -0.0362766 -0.0608629 0.0257393 -0.0205415 0.1785904 -0.1493522 -0.1144161 0.0064255 -0.099671 -0.0539373 0.099134 -0.0536701 -0.1249347 -0.0345353 -0.0054498 -0.0192166 0.0407481 0.0378847 0.0105793 0.0615418 0.0621124 0.1790076 0.005807 -0.1142887 0.1081077 -0.0670678 0.0210586 -0.0046807 -0.0753843 0.0136045 0.0365119 0.0154513 0.0909323 -0.0549436 0.0787677 0.0577104 0.1391124 0.0269195 -0.0871412 0.0871703 -0.0859142 0.0060804 0.0980594 -0.0287223 -0.0108632 -0.0903035 -0.0623822 0.0191894 -0.022044 0.0321667 0.0883021 -0.0146504 0.00048 0.0017976 0.0293141 0.0675481 0.0718085 -0.149493 0.0880772 -0.126288 -0.0916885 -0.0296051 -0.112276 -0.0572354 0.0940895 -0.0888045 -0.0329801 -0.0074766 -0.0043195 0.1040769 -0.044273 0.0288151 -0.0454737 -0.0805525 0.1050648 0.0279138 0.0979424 -0.0357553 -0.0328446 0.0892364 0.0630752 0.1251918 0.0230772 -0.1190863 0.0277393 -0.0131604 -0.0065288 unknown
polarizability: 116.857639|-0.5088281|116.4777077|2.1781945|9.9645656|127.7218705 unknown
InChI: InChI=1S/C6H15N2OPS/c1-7-5-4-6-8(2)10(7,11)9-3/h4-6H2,1-3H3
charge 0 multiplicity 1
26 atoms
S  -0.259474 -1.28824 -2.449035
P  -0.167198 -0.663385 -0.472882
O  -0.548452 -2.020769 0.558171
N  1.377981 -0.082842 0.164407
N  -1.277986 0.600797 0.074466
C  0.529512 2.21169 0.708178
C  1.661824 1.376154 0.085556
C  -0.813855 2.011838 -0.015253
C  2.530962 -0.94537 -0.19406
C  -2.681273 0.392187 -0.360011
C  -0.536772 -1.805488 2.023865
H  0.414714 1.939434 1.772935
H  0.807367 3.281606 0.653721
H  1.843967 1.698585 -0.967053
H  2.601631 1.54629 0.644952
H  -1.593257 2.632877 0.466048
H  -0.73524 2.346944 -1.076669
H  3.357701 -0.733541 0.508067
H  2.88356 -0.780157 -1.23432
H  2.2479 -2.006485 -0.093047
H  -3.342276 0.985804 0.29738
H  -2.948547 -0.672904 -0.257006
H  -2.853292 0.690491 -1.41597
H  0.455184 -1.453567 2.360114
H  -0.762461 -2.796528 2.447546
H  -1.30822 -1.071222 2.317601
