program: Gaussian 09
title: 000178620
version: EM64L-G09RevD.01
frameworkgroup: C1[X(C10H21N2O3PS)]
method: RPBEPBE
basis: SDD
operation: Freq
keyword: #p
keyword: freq=noraman
keyword: PBEPBE/SDD
title: #p freq=noraman PBEPBE/SDD
converged: YES YES NO NO
title: Mulliken charges:
elementType: S P O O O N N C C C C C C C C C C H H H H H H H H H H H H H H H H H H H H H
charge: 0.829984 1.133608 -0.580750 -0.582478 -0.591597 -0.580236 -0.513454 -0.296005 -0.317248 -0.377962 -0.353145 -0.439550 -0.437213 -0.372277 -0.364076 -0.404901 -0.753490 0.229319 0.239224 0.292118 0.236407 0.234172 0.291812 0.231289 0.256436 0.231311 0.231835 0.238501 0.221915 0.210749 0.197712 0.205411 0.208475 0.222028 0.203058 0.285085 0.264123 0.269809
chargesum: 0.00000
title: Mulliken charges with hydrogens summed into heavy atoms:
elementType: S P O O O N N C C C C C C C C C C
charge: 0.829984 1.133608 -0.580750 -0.582478 -0.591597 -0.580236 -0.513454 0.172538 0.211277 0.148022 0.134580 0.023596 0.023202 0.036184 0.049810 0.020185 0.065528
polarizability: 2.23391482e+02 -1.55260703e+01 2.12309185e+02 -4.20490599e+00 2.36021508e+00 1.59196106e+02
1716.lowfreq: -11.1739 -6.3650 0.0013 0.0020 0.0020 6.3805 13.0668 22.3344 35.9303
frequency: 10.3373 21.6607 35.7088 51.0516 65.1004 73.9091 80.1880 106.5385 113.4303 132.8965 140.1597 143.5248 172.2657 186.0291 232.9389 240.2294 244.9685 247.3816 284.4920 297.5988 304.1784 345.0498 383.9826 391.9606 429.1478 434.9322 469.8769 526.2140 551.8468 561.1963 655.6868 723.3151 769.0268 800.7108 827.7391 847.9614 850.3112 854.2703 859.4783 897.9328 912.7128 918.2964 926.0123 949.3829 953.4350 970.6120 976.6658 986.0908 1022.6761 1032.8553 1046.7980 1073.6188 1082.9446 1103.4967 1113.7944 1129.1824 1149.2395 1154.3224 1157.5745 1169.1897 1208.8786 1231.5434 1238.0093 1255.9027 1267.5232 1293.4958 1303.2492 1312.4513 1316.5556 1326.7381 1327.4843 1337.4266 1345.6671 1346.3466 1348.6208 1361.0804 1411.2999 1412.6237 1449.6908 1458.7445 1465.1632 1466.6791 1472.0799 1475.5533 1483.7999 1496.5418 1503.9671 2956.8545 2970.0176 2977.0419 2980.8017 2984.7953 2990.1709 2996.9707 3013.6823 3015.0755 3029.2054 3041.3731 3047.8360 3057.2396 3059.0247 3062.0803 3065.1398 3070.3962 3081.8997 3096.8708 3178.8386 3184.2579
redmass: 3.0920 5.6723 3.1004 4.1765 3.5043 3.3607 5.1792 2.5323 4.9224 2.0606 4.0462 2.9750 4.2028 4.7241 2.1966 2.8697 2.8962 2.0577 4.1774 5.8124 3.6758 8.0838 5.5987 1.8834 7.4679 2.9150 4.4510 2.1458 7.8316 1.8778 3.3623 2.6844 13.9683 1.4766 2.5760 1.6126 1.7187 3.6983 1.8823 2.4052 2.5909 1.4813 3.1516 1.3348 1.3849 1.9771 3.2149 1.6016 2.4485 3.3292 2.1171 1.6126 1.9542 3.7476 3.4781 1.9500 2.1538 1.2299 1.2797 1.7332 1.8681 1.2678 1.2513 1.2518 1.1662 1.1366 1.3356 1.4468 1.2345 1.3606 1.2555 1.3565 1.3202 1.3711 1.4155 1.3327 1.0543 1.0552 1.0910 1.0870 1.0893 1.0878 1.0835 1.0824 1.0848 1.0807 1.0828 1.0671 1.0669 1.0629 1.0652 1.0614 1.0612 1.0581 1.0623 1.0646 1.0244 1.0972 1.1004 1.1014 1.1062 1.0959 1.1002 1.0990 1.1024 1.1058 1.1074 1.1070
irintensity: 0.8426 5.5660 0.6998 0.9368 2.3644 1.4700 8.7371 0.2352 0.2938 2.5755 3.6938 1.3026 10.6389 14.1436 2.4583 1.1963 2.0737 0.6425 10.6233 29.3410 8.5770 108.5486 2.0211 5.8235 47.7268 0.5193 57.4210 6.7282 28.5913 3.0208 25.2827 4.7922 56.3253 0.6631 4.6392 23.0162 22.5324 22.3578 5.7189 7.3337 12.2901 5.2174 80.4646 6.1265 48.7585 25.5608 44.2881 50.1169 9.4035 91.6237 23.1417 12.7275 66.8839 55.9029 17.3249 32.6740 13.1424 0.8811 2.7865 23.9851 29.5912 8.6669 12.4546 0.3917 7.3807 4.7709 2.5117 6.2428 0.0746 4.3949 0.1727 0.6176 10.0248 2.2558 2.0151 7.0673 7.3404 13.1937 5.7284 13.3836 9.4232 20.4486 13.1444 4.3832 10.2414 7.8300 15.9375 29.3911 45.0370 35.7205 28.7750 7.6485 36.5661 13.3138 37.8896 30.3684 1.5932 61.4883 32.8267 38.9358 6.5250 23.5667 20.9330 22.2637 24.9325 41.0266 0.5363 1.8641
temp: 298.150 k
press: 1.00000 atm
elementType: 16 15 8 8 8 7 7 6 6 6 6 6 6 6 6 6 6 1 1 1 1 1 1 1 1 1 1 1 1 1 1 1 1 1 1 1 1 1
symmnumber: 1
zpe: 819267.4 jmol-1
zpe.correction: 0.312042 hartree
zpe.thermalcorrener: 0.332716 hartree
zpe.thermalcorrenthalpy: 0.333660 hartree
zpe.thermalcorrgfe: 0.259479 hartree
zpe.sumelectzpe: -1466.586515 hartree
zpe.sumelectthermal: -1466.565842 hartree
zpe.sumelectthermalent: -1466.564897 hartree
zpe.sumelectthermalfe: -1466.639079 hartree
dipole: -2.5928 4.6640 1.4076
dipole: 5.5188
quadrupole: -109.8591 -111.1287 -132.6412
quadrupole: 3.1538 6.5222 -10.5460
quadrupole: 8.0172 6.7476 -14.7649 3.1538 6.5222 -10.5460
hfenergy: -1466.8985578 hartree
pointgroup: C01 [X(C10H21N2O3P1S1)]
dipole: -0.4282052 1.9616028 0.826498 debye
polarizability: 213.3111786|-14.6548639|219.3395341|-10.2919709|11.711367|162.2460604 unknown
InChI: InChI=1S/C9H18N2OP.CH3O2S/c12-13(11-8-4-5-9-11)10-6-2-1-3-7-10;1-4(2)3/h1-9H2;1H3
charge 0 multiplicity 1
38 atoms
S  0.927531 -2.336609 -0.969045
P  0.490326 -0.362655 0.757595
O  0.675529 -0.98169 2.230876
O  2.223999 -2.093932 -1.963324
O  -0.549104 -2.670422 -1.635369
N  1.538056 0.853927 0.153987
N  -1.116477 0.14576 0.364464
C  1.235358 2.313777 0.033585
C  3.003356 0.560398 -0.027879
C  -1.501532 0.459064 -1.043583
C  -2.242195 -0.318841 1.219044
C  2.510347 2.864346 -0.644793
C  3.640329 1.969872 -0.074607
C  -2.57584 1.567515 -1.039595
C  -3.329308 0.777655 1.259778
C  -3.786785 1.154112 -0.168938
C  1.367584 -3.868784 0.106474
H  1.084855 2.766298 1.034772
H  0.327351 2.492468 -0.566156
H  3.157117 -0.004781 -0.964089
H  3.391205 -0.038859 0.816626
H  -0.603074 0.767077 -1.606438
H  -1.886582 -0.462194 -1.524514
H  -2.668125 -1.253832 0.79675
H  -1.852729 -0.541079 2.227377
H  2.659267 3.935808 -0.427278
H  2.439162 2.736778 -1.739977
H  4.549946 1.984576 -0.697655
H  3.912203 2.303105 0.943638
H  -2.892813 1.75913 -2.082427
H  -2.138483 2.505912 -0.644297
H  -2.921962 1.670104 1.772896
H  -4.183984 0.408135 1.85808
H  -4.530243 1.971967 -0.132404
H  -4.288858 0.28151 -0.634611
H  1.42373 -4.706433 -0.603359
H  2.333128 -3.656802 0.585037
H  0.557416 -3.98788 0.838359
