program: Gaussian 09
title: 000178608
version: EM64L-G09RevD.01
frameworkgroup: C1[X(C9H19N2O3PS)]
method: RPBEPBE
basis: SDD
operation: Freq
keyword: #p
keyword: freq=noraman
keyword: PBEPBE/SDD
title: #p freq=noraman PBEPBE/SDD
converged: NO YES NO NO
title: Mulliken charges:
elementType: S P O O O N N C C C C C C C C C H H H H H H H H H H H H H H H H H H H
charge: -0.256020 0.841312 -0.480137 -0.247877 -0.245349 -0.474330 -0.492793 -0.296969 -0.322049 -0.309820 -0.310454 -0.294220 -0.286629 -0.294648 -0.297174 -0.479262 0.243422 0.230064 0.219464 0.252186 0.224013 0.241821 0.224587 0.256318 0.222997 0.185926 0.191076 0.223275 0.222399 0.187917 0.193948 0.221573 0.220352 0.236479 0.248600
chargesum: 0.00000
title: Mulliken charges with hydrogens summed into heavy atoms:
elementType: S P O O O N N C C C C C C C C C
charge: -0.256020 0.841312 -0.480137 -0.247877 -0.245349 -0.474330 -0.492793 0.176518 0.149601 0.156015 0.170451 0.114703 0.127722 0.115668 0.118347 0.226169
polarizability: 1.65596791e+02 -1.03151475e+00 1.65550748e+02 -7.38555643e+00 8.45980740e+00 1.47051560e+02
1716.lowfreq: -15.1624 -0.0015 0.0017 0.0022 7.6106 11.1696 37.2761 39.4372 48.1552
frequency: 36.9222 39.2376 46.9547 60.6160 68.2307 111.0671 121.4800 137.1753 159.8674 178.4736 206.8584 225.7803 235.9893 257.1037 272.9182 304.9113 338.3841 347.0483 379.2678 389.7386 399.4227 435.2368 457.3976 459.9647 493.3995 573.4613 582.7088 635.0497 668.7806 680.1906 792.1943 796.8858 836.2313 840.0768 901.4158 903.9928 927.3753 934.7452 975.7582 1014.5110 1020.1392 1049.6364 1050.5543 1051.3785 1054.5283 1071.3816 1076.4275 1108.7839 1113.1519 1118.5934 1134.4940 1142.0116 1162.6117 1192.1580 1193.2933 1242.2916 1248.8028 1270.9186 1274.3681 1295.2949 1313.5808 1328.6572 1328.8211 1339.9526 1344.3169 1356.3919 1358.6340 1365.9752 1370.5947 1425.4885 1442.4818 1443.2317 1444.7298 1447.4738 1450.0337 1452.8083 1457.5483 1460.2039 1464.0838 1475.4450 2939.5702 2943.5381 2946.7567 2947.6079 2954.7155 2956.7389 2960.7220 2961.2183 2968.9556 3048.4828 3053.1170 3065.5532 3067.6328 3079.7163 3081.6412 3085.1539 3085.9600 3092.1430 3113.0101
redmass: 5.6449 3.1992 3.0471 5.9848 2.9518 1.7238 1.9755 5.1256 4.9043 3.7541 4.6613 2.9478 2.3256 3.0229 3.3548 3.4797 3.2171 3.8252 5.6715 1.9132 2.1874 7.1840 2.7763 2.7929 6.5299 2.4771 2.6205 7.4213 3.4795 4.0887 4.2010 4.1091 1.6421 1.6278 2.3796 2.3766 3.6911 3.3480 9.4743 2.3966 2.2856 2.1264 2.2366 2.2541 2.0345 3.9659 4.2421 2.1958 2.1753 1.2569 1.4117 4.1384 4.3328 1.0670 1.0742 1.2823 1.3338 1.2081 1.2215 1.3345 1.3825 1.2373 1.2270 1.2332 1.2308 1.3321 1.3284 1.2499 1.2616 1.1135 1.0817 1.0827 1.0814 1.0922 1.0957 1.0807 1.0846 1.0536 1.0873 1.0515 1.0684 1.0691 1.0681 1.0691 1.0637 1.0640 1.0646 1.0655 1.0306 1.0973 1.0961 1.1044 1.0958 1.0960 1.0957 1.0979 1.0976 1.0937 1.1021
irintensity: 0.2732 0.1002 0.1241 1.6159 3.1259 0.5844 0.7874 3.8526 4.5747 3.6211 14.0040 3.0218 7.9325 7.8570 7.5643 14.1676 4.0991 2.8167 2.7755 0.1170 0.3269 39.7310 1.1233 1.7283 31.5334 9.3741 3.9661 91.4434 47.8206 64.3363 9.6223 8.8511 0.4992 0.0691 21.7835 17.3260 238.5907 167.6795 115.6605 13.0995 5.1967 15.5585 17.6534 30.4122 27.0682 29.8558 34.9852 23.9511 28.1427 1.2803 2.3331 17.6746 15.8735 0.1079 1.1525 60.5330 47.5928 5.5663 3.5694 2.9989 1.8462 0.0171 1.1118 3.7170 5.0891 0.3252 0.4190 2.3820 1.9617 6.3692 8.9754 1.1784 9.1380 11.1730 18.9249 3.9128 9.4172 13.5327 13.9682 13.7022 47.9575 54.7457 46.0183 15.9045 40.9637 41.2921 82.5516 108.6487 77.0561 11.7007 20.2586 27.6844 12.7815 35.5193 32.5114 44.6498 31.1782 7.4558 17.0215
temp: 298.150 k
press: 1.00000 atm
elementType: 16 15 8 8 8 7 7 6 6 6 6 6 6 6 6 6 1 1 1 1 1 1 1 1 1 1 1 1 1 1 1 1 1 1 1
symmnumber: 1
zpe: 756759.6 jmol-1
zpe.correction: 0.288235 hartree
zpe.thermalcorrener: 0.306075 hartree
zpe.thermalcorrenthalpy: 0.307019 hartree
zpe.thermalcorrgfe: 0.241360 hartree
zpe.sumelectzpe: -1427.471047 hartree
zpe.sumelectthermal: -1427.453207 hartree
zpe.sumelectthermalent: -1427.452262 hartree
zpe.sumelectthermalfe: -1427.517922 hartree
dipole: -0.5058 -0.3320 -2.3516
dipole: 2.4282
quadrupole: -121.2483 -113.6072 -111.4906
quadrupole: -0.9874 -4.2957 -8.9094
quadrupole: -5.7996 1.8415 3.9581 -0.9874 -4.2957 -8.9094
hfenergy: -1427.7592816 hartree
pointgroup: C01 [X(C9H19N2O3P1S1)]
dipole: -0.2591457 0.0841346 0.9156478 debye
polarizability: 164.4489505|-0.1597165|164.337332|9.1769527|9.0823069|149.4128169 unknown
InChI: InChI=1S/C9H19N2O3PS/c1-12-15(16,10-2-6-13-7-3-10)11-4-8-14-9-5-11/h2-9H2,1H3
charge 0 multiplicity 1
35 atoms
S  -0.417497 -2.326994 -2.035691
P  -0.182125 -1.195255 -0.298926
O  0.007494 -2.13586 1.181047
O  -3.357934 2.091617 0.140399
O  3.682882 1.323377 -0.012122
N  -1.46637 -0.047707 -0.066372
N  1.237636 -0.193761 -0.039476
C  -1.551315 0.741839 1.187224
C  -2.73867 -0.119746 -0.817298
C  1.466465 0.88091 -1.046461
C  2.512506 -0.839133 0.383527
C  -2.0712 2.15238 0.850989
C  -3.21918 1.313971 -1.10483
C  2.411237 1.929292 -0.43283
C  3.430969 0.250147 0.964514
C  -0.741304 -3.402879 1.282629
H  -0.549461 0.797286 1.647511
H  -2.246378 0.251202 1.900849
H  -3.510458 -0.654786 -0.223841
H  -2.569715 -0.675578 -1.757625
H  0.499008 1.34757 -1.305912
H  1.917716 0.463404 -1.97263
H  3.01286 -1.327438 -0.481112
H  2.291332 -1.599647 1.148891
H  -2.269603 2.729685 1.769382
H  -1.321067 2.687648 0.227717
H  -2.499835 1.819197 -1.785584
H  -4.222799 1.310397 -1.560785
H  2.68123 2.695735 -1.178063
H  1.915559 2.411867 0.438238
H  2.967441 0.676435 1.880338
H  4.423312 -0.16414 1.207731
H  -1.798487 -3.211096 1.544769
H  -0.251024 -3.96635 2.091596
H  -0.689524 -3.968687 0.333409
