program: Gaussian 09
title: 000178607
version: EM64L-G09RevD.01
frameworkgroup: C1[X(C9H19N2O3PS)]
method: RPBEPBE
basis: SDD
operation: Freq
keyword: #p
keyword: freq=noraman
keyword: PBEPBE/SDD
title: #p freq=noraman PBEPBE/SDD
converged: NO YES NO NO
title: Mulliken charges:
elementType: S P O O O N N C C C C C C C C C H H H H H H H H H H H H H H H H H H H
charge: -0.028160 1.007410 -0.245490 -0.246261 -0.607591 -0.505528 -0.511140 -0.314653 -0.306110 -0.319299 -0.320650 -0.292941 -0.288468 -0.294524 -0.292658 -0.838841 0.239385 0.235673 0.239604 0.230166 0.243122 0.232488 0.260017 0.222854 0.186868 0.222725 0.222160 0.195634 0.186911 0.223860 0.224237 0.193735 0.320299 0.262558 0.262607
chargesum: 0.00000
title: Mulliken charges with hydrogens summed into heavy atoms:
elementType: S P O O O N N C C C C C C C C C
charge: -0.028160 1.007410 -0.245490 -0.246261 -0.607591 -0.505528 -0.511140 0.160405 0.163661 0.156311 0.162222 0.116651 0.129326 0.116247 0.125313 0.006624
polarizability: 1.69002527e+02 -5.20144333e+00 1.86281839e+02 7.69451708e+00 -4.13186277e+00 1.36957063e+02
1716.lowfreq: -15.9705 -9.1975 -0.0030 -0.0020 0.0003 12.8352 27.6577 32.6958 41.2665
frequency: 27.4307 32.2876 41.1870 46.9742 64.8822 105.7234 138.7196 159.8707 169.9168 200.9872 212.7637 217.6994 224.4981 244.4922 274.9305 285.6594 303.8200 310.6663 384.5779 395.3868 402.4738 435.4296 454.8724 460.6810 473.4597 550.0831 573.4830 639.2102 643.6619 671.7551 793.0949 794.5144 837.5556 839.3915 899.2360 900.5912 920.5675 928.6881 974.8400 987.2465 1005.8272 1015.1862 1016.8756 1048.5900 1050.4102 1051.8602 1054.4643 1073.0795 1073.8138 1109.0831 1111.9020 1138.6626 1154.6990 1190.4018 1191.2467 1241.9158 1245.8725 1271.9197 1272.4085 1299.1626 1302.4470 1325.5766 1327.4633 1340.2626 1340.7675 1351.9124 1353.7553 1357.7040 1366.7932 1367.9933 1440.4191 1443.0613 1447.1935 1449.5730 1450.5208 1453.6403 1457.4362 1461.0182 1462.9076 1468.0091 2941.2088 2942.4964 2946.8774 2952.2710 2956.5616 2958.5935 2961.3135 2962.8163 2986.6706 3056.1680 3056.3246 3066.5697 3071.1274 3079.9968 3082.5160 3086.2784 3087.6645 3109.3106 3145.8216
redmass: 3.3470 4.6330 3.8577 3.1660 4.5068 7.4577 4.7583 3.3424 1.2190 3.8900 3.6970 4.4468 3.1884 2.8128 2.8813 3.5904 4.0609 3.3689 2.4738 2.0994 3.3478 7.0704 2.8969 2.7794 8.0014 3.2650 2.4831 5.6292 2.9342 3.2397 4.1165 4.1870 1.6332 1.6425 2.3727 2.4358 3.5983 3.5510 1.1628 5.6260 1.2969 2.3345 2.2593 2.2497 2.0795 2.1089 2.3757 3.7912 4.1910 2.2103 2.2378 5.5037 4.8164 1.0626 1.0619 1.2747 1.3199 1.2176 1.2195 1.3454 1.3397 1.2409 1.2333 1.2274 1.2297 1.1493 1.3125 1.3150 1.2531 1.2534 1.0834 1.0830 1.0946 1.0952 1.0799 1.0764 1.0503 1.0868 1.0876 1.0562 1.0686 1.0690 1.0682 1.0676 1.0640 1.0649 1.0652 1.0641 1.0332 1.0968 1.0969 1.0956 1.0950 1.0960 1.0958 1.0981 1.0980 1.0978 1.1067
irintensity: 0.5495 0.3553 0.1158 0.3198 1.0048 0.2391 3.8451 4.6527 0.4281 19.1868 0.5544 14.4516 2.2739 3.3645 12.6213 11.7873 4.0453 6.2210 4.8394 0.1102 1.0921 43.4949 9.2745 0.6331 91.8318 22.1980 7.8814 20.0777 21.0038 31.4712 7.4859 11.6445 0.1780 0.0409 11.4437 18.6658 103.8685 227.0384 9.4283 88.4275 16.0427 13.3149 0.8483 17.7765 31.5026 3.1253 48.6320 40.0571 18.3362 31.4519 28.7007 23.9371 13.8265 0.0897 0.2058 69.1910 37.6082 7.0629 1.6253 4.1670 1.9780 0.5080 0.1100 6.0268 2.3249 5.3483 0.0190 0.3327 4.1077 1.3182 3.6340 3.8850 13.6512 20.3226 5.7166 4.0679 14.3563 4.4436 17.0989 10.0746 28.8828 77.9555 33.8752 26.7298 36.9882 20.6549 82.6703 125.2977 40.0754 10.1801 17.3352 15.9475 8.7121 32.3336 31.6736 39.9874 31.9079 5.6873 12.2585
temp: 298.150 k
press: 1.00000 atm
elementType: 16 15 8 8 8 7 7 6 6 6 6 6 6 6 6 6 1 1 1 1 1 1 1 1 1 1 1 1 1 1 1 1 1 1 1
symmnumber: 1
zpe: 754004.6 jmol-1
zpe.correction: 0.287185 hartree
zpe.thermalcorrener: 0.305212 hartree
zpe.thermalcorrenthalpy: 0.306157 hartree
zpe.thermalcorrgfe: 0.239549 hartree
zpe.sumelectzpe: -1427.470737 hartree
zpe.sumelectthermal: -1427.452710 hartree
zpe.sumelectthermalent: -1427.451766 hartree
zpe.sumelectthermalfe: -1427.518373 hartree
dipole: 0.0855 -0.4516 -0.9646
dipole: 1.0685
quadrupole: -120.5215 -108.8091 -117.2174
quadrupole: -2.5744 4.4886 -3.3981
quadrupole: -5.0055 6.7069 -1.7014 -2.5744 4.4886 -3.3981
hfenergy: -1427.7579222 hartree
pointgroup: C01 [X(C9H19N2O3P1S1)]
dipole: 0.0074385 0.2187884 0.35888 debye
polarizability: 166.908679|-0.525541|185.9680704|-7.8493507|-10.9031962|139.3646808 unknown
InChI: InChI=1S/C8H16N2O3P.CH3S/c11-14(9-1-5-12-6-2-9)10-3-7-13-8-4-10;1-2/h1-8H2;1H3
charge 0 multiplicity 1
35 atoms
S  0.364156 -2.489046 1.505419
P  0.30122 -1.077846 -0.358964
O  -3.785812 1.034296 0.151218
O  3.35185 2.323986 0.270852
O  0.647762 -1.895862 -1.700703
N  -1.238327 -0.274539 -0.123852
N  1.406864 0.261348 -0.141608
C  -1.543672 0.950267 -0.917955
C  -2.462941 -1.07246 0.153227
C  1.443795 0.990745 1.150646
C  2.737849 0.166371 -0.794633
C  -2.560259 1.796608 -0.130714
C  -3.461012 -0.183392 0.914868
C  2.025794 2.39579 0.902338
C  3.27041 1.593239 -1.006848
C  1.001868 -4.019863 0.588596
H  -1.974787 0.67495 -1.904203
H  -0.61136 1.517466 -1.08368
H  -2.195182 -1.952876 0.763884
H  -2.924566 -1.420251 -0.795459
H  2.075541 0.446022 1.884827
H  0.419115 1.067265 1.556458
H  2.628349 -0.364369 -1.756124
H  3.449186 -0.399718 -0.154806
H  -2.100231 2.138494 0.822602
H  -2.885994 2.669499 -0.720782
H  -4.421945 -0.704499 1.057795
H  -3.032921 0.093622 1.902275
H  1.332002 2.977988 0.256553
H  2.180961 2.929623 1.854411
H  4.30016 1.575817 -1.399723
H  2.607925 2.140036 -1.711916
H  1.067455 -3.770616 -0.48607
H  0.284742 -4.838595 0.74553
H  1.993303 -4.2805 0.985939
