program: Gaussian 09
title: 000178629
version: EM64L-G09RevD.01
frameworkgroup: C1[X(C21H21O2PS3)]
method: RPBEPBE
basis: SDD
operation: Freq
keyword: #p
keyword: freq=noraman
keyword: PBEPBE/SDD
title: #p freq=noraman PBEPBE/SDD
converged: YES YES NO NO
title: Mulliken charges:
elementType: S S S P O O C C C C C C C C C C C C C C C C C C C C C H H H H H H H H H H H H H H H H H H H H H
charge: 0.533191 -0.042377 -0.004808 0.546925 -0.596375 -0.556868 -0.855360 0.495988 -0.858204 -0.844375 0.542051 0.493130 -0.330263 -0.389923 -0.418930 -0.350480 -0.361591 -0.369386 -0.219296 -0.217891 -0.231961 -0.216990 -0.215340 -0.227531 -0.215794 -0.239307 -0.231471 0.269087 0.345900 0.328515 0.280785 0.282265 0.303146 0.255378 0.232368 0.230267 0.243209 0.304436 0.236070 0.230918 0.229678 0.232108 0.226228 0.231174 0.230106 0.230705 0.227783 0.233108
chargesum: 0.00000
title: Mulliken charges with hydrogens summed into heavy atoms:
elementType: S S S P O O C C C C C C C C C C C C C C C C C C C C C
charge: 0.533191 -0.042377 -0.004808 0.546925 -0.596375 -0.556868 -0.240373 0.495988 -0.248903 -0.258964 0.542051 0.493130 -0.074885 -0.157555 -0.188663 -0.107271 -0.057154 -0.133316 0.011622 0.011787 0.000147 0.009238 0.015834 0.002575 0.014911 -0.011524 0.001637
polarizability: 5.73689943e+02 -1.14048216e+00 4.16771641e+02 -3.73450111e+01 1.66865665e+01 2.02277251e+02
1716.lowfreq: -5.7804 -2.1566 -0.0025 -0.0024 -0.0024 1.5848 6.7483 10.2876 16.1480
frequency: 6.1530 10.0809 16.1296 19.9894 22.7567 31.0562 38.3951 42.9389 46.5706 55.6891 63.1246 70.9617 82.1351 88.5009 99.9602 115.7882 136.8883 145.9914 167.7595 193.7941 199.5646 237.6200 247.3128 253.2568 279.6249 302.0433 325.5493 333.5929 347.1204 367.6152 400.7986 402.8687 402.9844 414.9153 433.4183 464.2922 469.6302 529.3057 544.4271 549.1718 568.5532 607.6828 615.5550 615.7197 622.2676 631.2492 697.9532 699.3810 703.5642 766.6947 770.6070 773.2775 801.5494 801.9058 804.9580 826.0896 847.6774 850.8705 857.2522 884.7518 890.8920 892.8858 923.7997 927.3003 938.0729 961.0218 975.5505 978.2333 981.7963 987.9387 988.7203 989.3504 997.5223 998.9454 1004.6368 1025.9879 1026.3760 1026.6145 1074.9884 1078.5738 1082.7279 1131.7130 1135.4759 1149.8014 1172.9042 1174.4283 1174.5344 1188.7096 1190.9722 1195.6733 1218.4980 1223.0506 1226.9373 1229.6536 1240.3286 1264.8671 1326.4755 1329.3507 1333.7179 1384.3713 1385.6869 1387.0617 1424.0584 1438.7888 1441.0979 1441.3870 1455.0005 1459.9893 1481.9698 1483.1308 1484.3417 1589.2841 1590.4713 1591.9440 1610.0277 1610.1261 1610.2757 3008.0215 3031.2815 3035.0665 3098.9951 3113.3324 3114.5759 3117.3584 3118.5049 3120.6969 3124.1975 3127.9602 3130.8565 3131.2126 3139.5512 3143.8843 3145.4904 3151.4329 3155.8480 3162.3095 3167.3765 3168.6987
redmass: 6.1082 6.6298 6.1011 3.9388 3.8509 4.5179 4.8249 8.0940 5.6395 4.9938 5.7188 6.4825 7.9657 8.3477 7.4683 7.2187 7.6470 13.3280 12.4007 9.4130 6.9052 11.0678 4.9850 7.8440 6.8372 16.1476 2.3392 2.5154 2.0966 23.6298 2.7962 2.7897 2.8541 20.3297 5.1427 3.8317 3.8218 5.2457 5.9600 5.8001 3.8755 5.4337 6.3190 6.3243 5.6688 4.8597 1.7064 1.6989 1.7608 1.8405 1.9506 2.0623 4.1659 4.2367 4.2263 11.2412 1.2582 1.2506 1.2468 1.4978 1.7125 1.4804 1.4392 1.4363 1.4823 16.3849 1.4034 1.3918 1.5231 3.9460 5.7562 6.1639 1.3284 1.3283 1.3773 2.2095 2.2292 2.2041 1.5089 1.5421 1.5740 1.0838 1.0856 1.0844 1.0519 1.0523 1.0525 1.1110 1.1141 1.1391 3.0048 2.8162 3.1072 1.1441 1.1870 1.1762 1.2758 1.2721 1.2671 8.3285 8.5766 8.6599 1.1506 2.0657 2.1779 2.1988 1.1158 1.1454 2.2935 2.3151 2.2541 5.9714 5.9308 6.0224 5.9505 5.9146 6.0654 1.0629 1.0573 1.0578 1.1026 1.1091 1.0905 1.0875 1.1006 1.0956 1.0863 1.0875 1.0904 1.0871 1.0921 1.0920 1.0955 1.0965 1.0962 1.1013 1.1017 1.1014
irintensity: 0.1628 0.0084 0.6953 0.3968 0.4176 0.1915 0.2142 0.2065 0.6805 0.5462 2.1520 3.2834 0.9901 2.8750 2.5100 1.1233 4.0812 0.6352 3.9272 1.3424 3.8017 5.4832 1.7161 10.5933 12.7728 1.9934 0.3506 1.9600 1.2039 119.1978 0.3640 0.2314 6.2665 168.4852 3.9179 5.0334 5.4080 19.6229 17.7771 11.4321 12.5371 24.0768 0.3280 0.3009 43.0318 43.0678 47.8941 54.2440 56.8996 34.3448 32.8186 29.5157 5.3915 7.3409 4.4790 62.1943 0.1134 0.0136 1.0212 3.4566 1.1079 0.1226 1.7959 1.8163 3.1693 50.1988 0.2435 0.0346 0.6977 0.0877 0.6916 2.4036 0.0310 0.0129 1.1289 10.3091 4.9352 6.5556 7.9789 7.4764 11.3870 3.5434 3.1487 2.1606 0.2078 0.0033 0.0642 7.8392 4.1612 1.6929 5.6139 11.8110 10.8972 11.7964 21.1752 31.1230 0.4488 0.4792 1.4742 0.5087 0.4861 1.1997 6.4262 13.7219 9.6736 9.8346 17.4737 10.2560 9.8815 14.7878 10.6563 2.7723 1.3010 0.9185 0.6676 0.6667 0.5115 17.2674 8.5665 1.7992 5.4772 2.9126 6.2245 7.0058 0.2574 9.7541 5.4830 1.1073 4.3026 0.3671 10.3128 20.3394 29.0634 32.3381 33.0977 49.2659 38.3942 22.6925
temp: 298.150 k
press: 1.00000 atm
elementType: 16 16 16 15 8 8 6 6 6 6 6 6 6 6 6 6 6 6 6 6 6 6 6 6 6 6 6 1 1 1 1 1 1 1 1 1 1 1 1 1 1 1 1 1 1 1 1 1
symmnumber: 1
zpe: 949488.2 jmol-1
zpe.correction: 0.361641 hartree
zpe.thermalcorrener: 0.390595 hartree
zpe.thermalcorrenthalpy: 0.391539 hartree
zpe.thermalcorrgfe: 0.292269 hartree
zpe.sumelectzpe: -2496.695169 hartree
zpe.sumelectthermal: -2496.666216 hartree
zpe.sumelectthermalent: -2496.665271 hartree
zpe.sumelectthermalfe: -2496.764542 hartree
dipole: -1.7196 -1.7722 -1.2995
dipole: 2.7904
quadrupole: -156.7044 -162.7310 -202.1365
quadrupole: -3.5414 0.3672 9.1615
quadrupole: 17.1529 11.1263 -28.2792 -3.5414 0.3672 9.1615
hfenergy: -2497.0568104 hartree
pointgroup: C01 [X(C21H21O2P1S3)]
dipole: -0.5145697 0.8330823 -0.496414 debye
polarizability: 427.8933765|39.3028281|562.8480778|22.0491252|34.1191093|201.9973802 unknown
InChI: InChI=1S/C7H7OS.2C7H7S.OP/c8-9-6-7-4-2-1-3-5-7;2*8-6-7-4-2-1-3-5-7;1-2/h1-5H,6H2;2*1-5H,6H2;
charge 0 multiplicity 1
48 atoms
S  -1.597431 -0.474281 -0.688612
S  2.11186 0.427214 -0.117727
S  -0.284889 3.104344 1.06764
P  0.079346 0.7983 0.946954
O  -0.005094 0.047439 2.368621
O  -0.681999 -1.800705 -1.087554
C  -2.630939 -1.08654 0.893759
C  -3.60747 -2.140003 0.477751
C  2.760409 -0.941726 1.087024
C  0.622699 3.675446 -0.535895
C  3.245438 -2.144588 0.316377
C  0.743143 5.178574 -0.468473
C  -3.18096 -3.484586 0.302859
C  -4.96802 -1.809268 0.23334
C  4.622992 -2.483832 0.338063
C  1.83011 5.783022 0.217407
C  2.340988 -2.959288 -0.417259
C  -0.229573 6.008747 -1.08479
C  -4.100809 -4.476313 -0.100102
C  -5.887188 -2.803339 -0.165401
C  -5.455361 -4.140099 -0.3335
C  5.092574 -3.629643 -0.343967
C  1.947044 7.18819 0.276069
C  2.813564 -4.099253 -1.100869
C  -0.113059 7.414952 -1.026256
C  4.187374 -4.441446 -1.0643
C  0.975672 8.008195 -0.345665
H  -3.099415 -0.161812 1.26834
H  -1.841121 -1.421755 1.58569
H  1.910836 -1.158542 1.760249
H  3.562516 -0.463438 1.670144
H  0.020267 3.344119 -1.395096
H  1.603433 3.172587 -0.538793
H  -2.130603 -3.741851 0.475184
H  -5.306649 -0.774141 0.365963
H  5.327652 -1.852992 0.894299
H  2.580145 5.148436 0.703926
H  1.281116 -2.682047 -0.477149
H  -1.075376 5.550772 -1.61167
H  -3.763051 -5.509991 -0.232477
H  -6.93553 -2.538777 -0.342297
H  -6.168185 -4.912667 -0.642596
H  6.158061 -3.884119 -0.315239
H  2.792381 7.643579 0.803452
H  2.110297 -4.719539 -1.667857
H  -0.866991 8.045523 -1.510133
H  4.548155 -5.328641 -1.597119
H  1.066843 9.099082 -0.300315
