program: Gaussian 09
title: 000178601
version: EM64L-G09RevD.01
frameworkgroup: C1[X(C12H25N2OPS)]
method: RPBEPBE
basis: SDD
operation: Freq
keyword: #p
keyword: freq=noraman
keyword: PBEPBE/SDD
title: #p freq=noraman PBEPBE/SDD
converged: YES YES NO NO
title: Mulliken charges:
elementType: S P O N N C C C C C C C C C C C C H H H H H H H H H H H H H H H H H H H H H H H H H
charge: -0.278697 0.827370 -0.490069 -0.453255 -0.468581 -0.315232 -0.348922 -0.329550 -0.327977 -0.377560 -0.360924 -0.376500 -0.374713 -0.398322 -0.400813 -0.202333 -0.660076 0.249035 0.206507 0.196994 0.255223 0.228692 0.220951 0.201551 0.256294 0.200472 0.199471 0.200484 0.201649 0.202216 0.198207 0.198022 0.204008 0.189584 0.217843 0.194267 0.216122 0.200697 0.237254 0.207690 0.226533 0.226386
chargesum: 0.00000
title: Mulliken charges with hydrogens summed into heavy atoms:
elementType: S P O N N C C C C C C C C C C C C
charge: -0.278697 0.827370 -0.490069 -0.453255 -0.468581 0.140310 0.103295 0.120093 0.129868 0.022383 0.041209 0.023923 0.027317 0.009105 0.009576 0.235618 0.000534
polarizability: 1.93364564e+02 1.19084364e+00 1.93262338e+02 -3.92699364e+00 8.56773256e+00 1.73462979e+02
1716.lowfreq: -16.7204 -0.0007 0.0002 0.0019 0.8980 17.4946 24.6484 30.5377 37.5787
frequency: 24.0123 29.7867 36.2494 49.2372 54.2241 57.6454 101.9970 124.5532 151.2603 161.3720 198.2058 220.1338 220.8308 242.5402 254.1527 261.8315 281.1973 296.0424 323.1560 350.3188 374.0963 383.4996 423.4546 433.9964 441.6375 445.9460 483.8576 527.4884 555.8120 652.5793 668.2796 679.4710 802.4704 804.3849 807.6545 827.9101 830.6604 846.9623 851.0233 878.4051 905.5809 906.0564 923.8061 940.4779 948.6370 952.7226 1019.1294 1021.6915 1030.9171 1050.9020 1056.4336 1073.2494 1081.8803 1102.2853 1118.3229 1126.5493 1140.3909 1147.3235 1151.9062 1152.2069 1153.3548 1209.4283 1220.0616 1253.6037 1256.3423 1259.9879 1269.4811 1273.0732 1301.3947 1317.2728 1329.4761 1330.3955 1336.4619 1338.1577 1344.9487 1346.5754 1346.8635 1350.7019 1361.2605 1364.4283 1369.0678 1391.7050 1449.7639 1452.2487 1457.7914 1459.0455 1459.5770 1460.0024 1464.5270 1465.2455 1469.3975 1472.8711 1477.2258 1479.3005 1492.6421 2913.4409 2919.4658 2919.8696 2926.9729 2966.7929 2969.1529 2969.9523 2979.9697 2982.9353 2983.3635 2986.2371 2990.8851 3031.5313 3032.8130 3035.1724 3041.2281 3043.8585 3045.9298 3051.3666 3052.6544 3056.0143 3067.1114 3087.4933 3094.6583 3101.8503
redmass: 2.4945 3.0302 3.3856 3.2422 3.2824 2.8156 4.0795 5.9906 4.3589 3.2042 3.0075 2.2824 2.2818 2.5147 1.6207 2.5246 2.7197 3.1910 3.4161 3.4762 1.7130 2.0346 4.3484 3.7997 3.1795 2.9713 2.5535 2.0206 2.9781 5.1272 4.0477 4.9025 1.4790 1.4754 1.0974 2.7241 2.6918 1.5316 1.4962 3.3528 2.4090 2.4231 3.3026 2.8946 1.3471 1.3057 2.3330 2.3507 2.8792 1.9707 2.0430 1.5669 1.4063 2.1544 3.2392 3.1856 1.4692 2.2853 2.1131 1.2553 1.2068 1.8932 2.3022 1.2498 1.2498 1.1244 1.1648 1.1622 1.3534 1.4749 1.2653 1.2899 1.3777 1.3796 1.3905 1.4294 1.4202 1.3648 1.2631 1.3287 1.3455 1.2507 1.0910 1.0906 1.0842 1.0875 1.0483 1.0768 1.0824 1.0881 1.0769 1.0891 1.0629 1.0724 1.0790 1.0708 1.0686 1.0687 1.0694 1.0629 1.0569 1.0623 1.0609 1.0612 1.0608 1.0614 1.0361 1.1066 1.0964 1.0969 1.1009 1.1009 1.0947 1.0964 1.1028 1.1010 1.0936 1.0984 1.0912 1.1016
irintensity: 0.0708 0.6291 0.5648 0.2318 0.8439 1.6558 1.9534 2.6511 3.3395 1.8223 8.3830 0.9017 1.1102 1.7376 4.7567 2.6605 0.6162 3.2640 1.6097 1.5267 3.2054 2.6460 12.5700 17.4375 2.7059 0.7685 4.6320 15.4980 34.5178 77.9464 61.8727 76.1779 0.6040 0.3441 2.9578 5.2072 9.5598 11.9070 9.1614 141.0049 3.6621 0.6959 143.2385 135.2794 12.1006 2.0259 8.5828 2.7587 137.8819 49.4658 17.5351 14.6264 8.7013 9.0881 9.1637 12.0502 3.8736 18.5800 20.9160 2.0960 0.5312 31.9486 32.8572 0.6583 0.2913 2.4770 9.9210 11.3687 2.1216 1.3906 2.0144 0.5773 0.6295 0.1761 1.6209 0.9024 0.8826 1.1430 4.4406 2.0847 5.3781 26.2667 6.6808 6.6480 8.2949 10.5054 20.8598 11.5597 14.3056 10.2555 4.6463 7.7160 5.0476 10.0642 8.6117 50.2696 70.5527 41.6886 63.7676 41.6453 55.2232 30.7889 29.8470 28.7900 39.2969 33.8558 31.6048 15.5873 63.2436 68.7152 38.6162 37.8670 18.7918 9.3909 80.7192 80.5715 12.7503 33.5338 7.5049 37.0820
temp: 298.150 k
press: 1.00000 atm
elementType: 16 15 8 7 7 6 6 6 6 6 6 6 6 6 6 6 6 1 1 1 1 1 1 1 1 1 1 1 1 1 1 1 1 1 1 1 1 1 1 1 1 1
symmnumber: 1
zpe: 957270.9 jmol-1
zpe.correction: 0.364605 hartree
zpe.thermalcorrener: 0.384241 hartree
zpe.thermalcorrenthalpy: 0.385186 hartree
zpe.thermalcorrgfe: 0.314626 hartree
zpe.sumelectzpe: -1394.904622 hartree
zpe.sumelectthermal: -1394.884986 hartree
zpe.sumelectthermalent: -1394.884042 hartree
zpe.sumelectthermalfe: -1394.954602 hartree
dipole: -0.5363 -1.7725 -3.0513
dipole: 3.5693
quadrupole: -111.0274 -113.7265 -128.6565
quadrupole: -1.1402 1.8565 -6.5077
quadrupole: 6.7761 4.0770 -10.8531 -1.1402 1.8565 -6.5077
hfenergy: -1395.2692272 hartree
pointgroup: C01 [X(C12H25N2O1P1S1)]
dipole: 0.0919862 0.6548179 -1.2388202 debye
polarizability: 191.1012646|2.146317|193.1453648|8.2079675|-7.7605606|175.8432516 unknown
InChI: InChI=1S/C12H25N2OPS/c1-2-15-16(17,13-9-5-3-6-10-13)14-11-7-4-8-12-14/h2-12H2,1H3
charge 0 multiplicity 1
42 atoms
S  0.511373 -1.425485 2.644125
P  0.281404 -0.822946 0.652995
O  0.270637 -2.149181 -0.511057
N  1.472023 0.336219 0.152787
N  -1.2175 -0.084265 0.100666
C  1.512954 0.805551 -1.254621
C  2.695953 0.600865 0.939809
C  -1.581861 1.186922 0.790656
C  -2.392821 -0.968819 -0.143438
C  1.808744 2.321349 -1.298635
C  3.006755 2.114359 0.937242
C  -2.585554 1.976657 -0.075305
C  -3.411767 -0.225339 -1.033011
C  3.095499 2.657522 -0.508637
C  -3.832273 1.119542 -0.396265
C  1.138441 -3.319885 -0.229426
C  0.713172 -4.42276 -1.197569
H  0.543551 0.577015 -1.728889
H  2.306976 0.256028 -1.808587
H  3.556933 0.047228 0.500499
H  2.538956 0.225278 1.966588
H  -0.661184 1.774013 0.954462
H  -2.030377 0.970903 1.787743
H  -2.87408 -1.24978 0.822282
H  -2.038638 -1.887474 -0.635117
H  0.948905 2.866769 -0.862212
H  1.904904 2.642003 -2.354371
H  3.95654 2.289454 1.478651
H  2.205672 2.643808 1.489269
H  -2.086436 2.277888 -1.017117
H  -2.874395 2.900932 0.461717
H  -4.29422 -0.875709 -1.188662
H  -2.95096 -0.042098 -2.022922
H  3.967011 2.195838 -1.018656
H  3.270325 3.750051 -0.502275
H  -4.390821 0.921944 0.542102
H  -4.516665 1.670008 -1.069058
H  2.197918 -3.033493 -0.385716
H  1.008429 -3.622151 0.827983
H  1.339938 -5.321018 -1.044166
H  -0.34173 -4.700523 -1.030286
H  0.82587 -4.09212 -2.244479
