program: Gaussian 09
title: 000178599
version: EM64L-G09RevD.01
frameworkgroup: C1[X(C11H23N2OPS)]
method: RPBEPBE
basis: SDD
operation: Freq
keyword: #p
keyword: freq=noraman
keyword: PBEPBE/SDD
title: #p freq=noraman PBEPBE/SDD
converged: NO YES NO NO
title: Mulliken charges:
elementType: S P O N N C C C C C C C C C C C H H H H H H H H H H H H H H H H H H H H H H H
charge: 0.432409 0.734514 -0.654857 -0.482562 -0.546033 -0.368048 -0.361641 -0.368548 -0.339135 -0.359980 -0.369821 -0.375340 -0.356468 -0.396040 -0.402273 -0.839725 0.202253 0.214294 0.206142 0.246727 0.215010 0.278359 0.215630 0.197532 0.257452 0.184884 0.185212 0.258994 0.204526 0.197147 0.202922 0.197662 0.174542 0.220900 0.219304 0.191932 0.239975 0.270249 0.271898
chargesum: 0.00000
title: Mulliken charges with hydrogens summed into heavy atoms:
elementType: S P O N N C C C C C C C C C C C
charge: 0.432409 0.734514 -0.654857 -0.482562 -0.546033 0.048498 0.091227 0.124821 0.074027 0.082356 0.074385 0.026334 0.044117 -0.000598 0.008963 -0.057603
polarizability: 2.23521815e+02 8.75406288e+00 1.93619280e+02 6.54620856e+00 5.52995592e+00 1.62974604e+02
1716.lowfreq: -15.6484 -0.0017 -0.0006 -0.0005 6.2661 19.6934 32.7711 54.8143 59.3861
frequency: 29.7231 54.7067 59.2779 73.0988 85.3184 98.3866 99.5050 118.6373 143.5199 148.7793 172.3260 206.6383 226.1780 244.8654 265.7862 271.3147 286.4766 305.1699 321.1865 380.8115 395.7013 417.6656 432.6554 437.1701 447.6599 513.7938 524.8234 577.3369 642.2574 655.8096 755.3907 804.3940 809.6737 823.5430 826.8708 850.7217 856.4094 886.9434 898.2484 926.3419 930.5883 937.3652 952.3187 955.1881 959.2393 1018.7498 1025.4754 1037.0270 1050.2458 1073.6515 1079.3206 1114.9027 1117.9686 1145.2175 1149.3236 1150.6751 1162.0798 1204.9062 1214.6242 1254.4709 1266.1741 1270.5288 1271.5757 1302.9375 1303.6925 1315.6524 1322.0416 1328.7782 1336.6969 1339.6619 1344.0734 1348.0136 1353.5176 1357.3815 1365.1385 1369.5254 1421.0842 1443.6583 1445.5921 1451.9541 1456.7758 1460.9718 1462.1650 1464.1813 1465.2479 1471.6881 1475.8545 1493.0002 2904.0609 2914.0593 2925.7865 2931.8514 2954.7253 2968.8199 2972.2303 2980.7258 2981.7143 2983.3123 3009.2495 3022.1834 3034.0379 3035.9658 3037.4761 3043.2494 3046.4977 3049.7882 3053.9869 3056.4494 3091.9669 3137.6029 3150.0605
redmass: 4.9785 3.7993 3.5652 3.3558 4.5877 3.6378 3.7150 4.5597 1.5552 2.1048 4.2584 4.1998 3.1545 2.6653 3.7264 2.3394 2.9589 2.4618 3.5392 2.7981 2.6054 2.0700 2.9489 2.8665 3.3235 1.8863 1.9609 6.6829 3.0638 3.0602 13.0822 1.4778 1.4752 2.8723 2.7362 1.4931 1.4686 2.4287 2.3965 2.3208 1.4426 2.6454 1.3324 1.3507 1.3400 2.2920 2.2332 1.9997 2.0347 1.5383 1.4351 2.9948 3.2460 1.8138 2.2725 1.3754 1.2875 1.9210 2.1880 1.2617 1.1839 1.2898 1.2341 1.3034 1.2116 1.3586 1.2526 1.2737 1.3405 1.4182 1.4271 1.4024 1.3659 1.2873 1.3309 1.2587 1.0559 1.0740 1.0694 1.0913 1.0846 1.0784 1.0864 1.0836 1.0888 1.0866 1.0892 1.0780 1.0688 1.0695 1.0709 1.0655 1.0654 1.0628 1.0605 1.0614 1.0613 1.0609 1.0270 1.0954 1.0961 1.0951 1.0927 1.1011 1.1053 1.0958 1.1031 1.1036 1.0890 1.1045 1.1046
irintensity: 5.9056 0.1231 2.8997 0.4508 0.7794 0.4855 6.8513 2.2200 0.7324 0.0836 5.1084 0.9105 0.9580 2.6394 4.2460 4.6593 1.9429 0.7677 7.2072 3.4796 9.7711 5.9272 1.6596 0.5196 1.7916 3.2983 4.0091 11.4369 18.0630 19.1817 48.4662 0.2307 0.4549 3.6907 4.7435 15.2211 10.7781 1.6983 3.3949 138.5842 62.4309 33.3087 6.6720 5.7386 6.1189 4.3577 3.0532 31.1888 26.4982 11.6808 7.8589 6.9756 8.8083 10.9905 10.5227 9.7133 2.2214 15.2767 28.9678 0.8710 4.9800 6.5862 4.7669 1.4993 9.5017 1.1210 1.1631 0.8584 0.6116 0.9134 3.5299 2.8129 17.4207 2.9122 12.0975 4.0356 7.9755 12.8404 9.3592 5.3318 21.4987 9.5030 10.4887 11.0210 29.0807 0.2831 9.9253 4.1746 92.0105 42.3311 42.9491 93.8943 57.2326 41.8850 55.7009 2.9557 74.7889 44.0464 24.1083 30.6397 69.6226 48.9208 31.5979 16.0928 21.9254 4.0536 90.5563 36.2635 8.8573 7.2888 9.8837
temp: 298.150 k
press: 1.00000 atm
elementType: 16 15 8 7 7 6 6 6 6 6 6 6 6 6 6 6 1 1 1 1 1 1 1 1 1 1 1 1 1 1 1 1 1 1 1 1 1 1 1
symmnumber: 1
zpe: 876873.6 jmol-1
zpe.correction: 0.333984 hartree
zpe.thermalcorrener: 0.352808 hartree
zpe.thermalcorrenthalpy: 0.353752 hartree
zpe.thermalcorrgfe: 0.286593 hartree
zpe.sumelectzpe: -1355.618304 hartree
zpe.sumelectthermal: -1355.599480 hartree
zpe.sumelectthermalent: -1355.598536 hartree
zpe.sumelectthermalfe: -1355.665695 hartree
dipole: -1.9768 -0.4719 -2.9500
dipole: 3.5823
quadrupole: -105.8769 -107.2083 -119.8754
quadrupole: -0.2122 -7.1421 -3.7724
quadrupole: 5.1100 3.7785 -8.8885 -0.2122 -7.1421 -3.7724
hfenergy: -1355.9522876 hartree
pointgroup: C01 [X(C11H23N2O1P1S1)]
dipole: -0.6678738 -0.3266552 -1.1973477 debye
polarizability: 210.5462084|17.2328273|203.3852782|3.7655704|13.7206641|166.1842121 unknown
InChI: InChI=1S/C10H20N2P.CH3OS/c1-3-7-11(8-4-1)13-12-9-5-2-6-10-12;1-3-2/h1-10H2;1H3
charge 0 multiplicity 1
39 atoms
S  -0.333833 2.301817 1.219462
P  -0.613447 0.851189 -1.119981
O  0.921506 1.435208 1.970055
N  0.920792 0.008289 -1.006823
N  -1.742281 -0.312538 -0.416913
C  2.143832 0.725566 -1.440416
C  1.186109 -1.356657 -0.508122
C  -1.736833 -0.697227 1.022536
C  -3.081422 -0.424876 -1.05112
C  3.189758 0.793041 -0.300922
C  2.202024 -1.344521 0.658704
C  -2.250935 -2.142842 1.199254
C  -3.608301 -1.873449 -0.935179
C  3.504599 -0.628973 0.224186
C  -3.641207 -2.320079 0.545619
C  0.541568 3.820679 0.453691
H  1.866057 1.739397 -1.787877
H  2.575413 0.182754 -2.310928
H  1.611201 -1.943092 -1.354496
H  0.231961 -1.828647 -0.227947
H  -2.400594 -0.004562 1.590384
H  -0.721122 -0.572453 1.436663
H  -3.00325 -0.124846 -2.112203
H  -3.806443 0.262745 -0.555465
H  2.766668 1.388828 0.530265
H  4.108195 1.284658 -0.678043
H  2.413009 -2.386268 0.971486
H  1.755802 -0.795466 1.508759
H  -2.294779 -2.379881 2.279714
H  -1.532417 -2.8475 0.735529
H  -2.943746 -2.542725 -1.515421
H  -4.619157 -1.930278 -1.38398
H  4.00939 -1.221132 -0.569776
H  4.206279 -0.568442 1.076948
H  -3.975037 -3.371779 0.625223
H  -4.383636 -1.704005 1.09467
H  -0.168065 4.327752 -0.22007
H  1.429794 3.472985 -0.092994
H  0.836645 4.479929 1.284129
