program: Gaussian 09
title: 000178603
version: EM64L-G09RevD.01
frameworkgroup: C1[X(C12H25N2O2PS)]
method: RPBEPBE
basis: SDD
operation: Freq
keyword: #p
keyword: freq=noraman
keyword: PBEPBE/SDD
title: #p freq=noraman PBEPBE/SDD
converged: YES YES NO NO
title: Mulliken charges:
elementType: S P O O N N C C C C C C C C C C C C H H H H H H H H H H H H H H H H H H H H H H H H H
charge: 0.773191 0.839851 -0.629974 -0.648792 -0.569812 -0.504217 -0.419338 -0.332959 -0.365383 -0.363885 -0.382833 -0.419370 -0.378799 -0.386269 -0.388670 -0.394668 -0.556074 -0.629688 0.231398 0.327791 0.230295 0.222497 0.230216 0.216272 0.211194 0.243844 0.210487 0.209499 0.225724 0.214241 0.292126 0.193784 0.189931 0.284653 0.209394 0.212909 0.172622 0.228652 0.242998 0.233193 0.210599 0.254060 0.259313
chargesum: 0.00000
title: Mulliken charges with hydrogens summed into heavy atoms:
elementType: S P O O N N C C C C C C C C C C C C
charge: 0.773191 0.839851 -0.629974 -0.648792 -0.569812 -0.504217 0.139851 0.119833 0.081105 0.091153 0.037153 0.020596 0.107111 0.088314 0.033633 0.006605 -0.079883 0.094284
polarizability: 2.60937539e+02 1.57597703e+01 2.52175547e+02 4.64750347e+00 7.96893157e+00 1.69890818e+02
1716.lowfreq: -20.2638 -15.4264 -4.7673 -0.0014 -0.0008 0.0013 6.6769 18.4320 34.5920
frequency: -10.4488 14.1251 33.9563 41.9625 47.5557 55.6359 84.9144 91.8050 105.2076 109.3108 128.2412 160.1162 174.2236 199.2358 217.3898 244.1123 248.5143 261.1561 270.5637 290.0371 301.5511 315.5863 331.1914 393.1993 416.4283 431.3309 445.0934 452.7639 483.1552 493.0542 525.8874 534.9580 658.4163 690.8499 730.8457 767.8202 778.6041 805.7333 818.5834 822.1415 827.1070 848.9204 856.1270 882.5082 894.5284 929.0895 931.8228 945.2102 950.6315 969.8559 1001.7287 1011.3272 1024.0880 1033.8770 1051.1547 1058.9408 1071.6820 1080.7695 1106.2777 1110.6002 1138.5023 1145.2313 1163.9517 1165.2726 1196.0226 1205.8170 1232.7138 1237.0769 1245.5325 1256.7186 1261.9349 1269.0409 1300.3195 1313.0996 1320.0794 1321.5348 1325.4865 1338.5013 1340.3764 1348.1397 1350.0203 1362.0734 1363.8334 1370.0204 1385.4648 1415.6893 1455.3835 1455.7890 1460.6105 1466.4357 1468.7025 1471.0812 1471.5762 1474.4094 1480.4956 1486.7776 1488.2798 1497.4518 2941.1826 2943.2835 2951.3867 2952.1799 2954.5326 2976.3171 2981.5437 2984.3692 2984.5819 2994.1827 2996.3452 3032.2340 3032.4176 3037.0506 3039.3273 3040.8821 3046.2384 3053.9644 3054.8931 3057.2330 3065.8424 3078.7669 3096.6761 3112.9096 3125.5217
redmass: 3.3422 3.0651 3.1116 3.1273 4.8359 3.5143 3.5158 6.7219 5.9316 5.5217 2.9708 5.4386 2.9960 1.3540 4.2986 2.1611 2.6216 2.2082 2.3570 2.3877 3.0590 7.8537 2.4782 3.8307 2.3363 2.9278 3.1611 4.7942 4.3124 9.0997 2.6181 2.1500 2.8650 2.2853 12.3388 1.4069 1.6135 1.4843 1.9312 2.6470 2.8608 1.5229 1.9700 2.5464 2.6205 2.8089 2.9056 1.5117 1.4269 1.4557 2.0919 1.2461 2.2208 2.0660 2.3109 2.8111 1.9521 1.6206 3.0658 4.3630 2.2944 2.2706 1.2338 1.1917 1.5879 1.6676 1.2695 1.2559 1.2379 1.1902 1.3169 1.1985 1.2494 1.3500 1.2696 1.3360 1.2971 1.4041 1.3350 1.3489 1.3193 1.2910 1.3064 1.3085 1.1814 1.1145 1.0359 1.0808 1.0874 1.0783 1.0850 1.0778 1.0789 1.0891 1.0866 1.0505 1.0810 1.0730 1.0659 1.0712 1.0646 1.0703 1.0673 1.0607 1.0615 1.0383 1.0571 1.0638 1.0629 1.0825 1.0695 1.0990 1.0948 1.0981 1.1040 1.1042 1.0976 1.1002 1.1039 1.0970 1.1015 1.0888 1.1090
irintensity: 0.9354 0.2397 0.3929 0.7128 4.0300 1.2720 1.6573 2.7687 4.0915 6.4007 0.9601 13.1003 0.6686 0.9763 30.4018 2.8319 0.7311 1.6053 0.0830 0.6205 27.0258 7.0657 7.0514 4.0034 11.4376 0.5892 0.9837 5.5591 10.3554 24.8122 4.9876 10.2399 15.6287 33.6354 42.6101 4.4419 10.9238 0.9921 8.5516 6.3300 80.8145 12.4964 7.2339 3.3073 3.3320 91.0837 107.6646 33.6127 9.7441 33.8914 43.3576 0.3103 5.6980 15.3518 53.2691 19.1785 2.2833 21.3678 2.1659 6.5664 10.2977 15.2560 0.9087 0.1692 5.8086 19.9362 9.0159 24.7349 6.0981 4.3853 0.4786 4.7895 4.4848 1.5161 0.1887 3.1346 1.6871 4.0913 5.0403 21.3656 3.7509 0.3904 9.4200 5.6311 33.5030 1.5362 15.2348 15.0525 17.4040 7.5685 8.7141 11.6740 15.0690 19.6412 0.0969 11.1527 10.8409 18.0048 69.3979 37.8513 66.2970 12.9818 93.1709 39.5898 64.1422 33.7690 40.2862 47.2737 44.4596 3.7004 17.9132 12.1624 36.9468 26.0357 8.7853 21.1916 37.9109 50.0962 70.7478 13.1808 1.7379 7.9567 19.0450
temp: 298.150 k
press: 1.00000 atm
elementType: 16 15 8 8 7 7 6 6 6 6 6 6 6 6 6 6 6 6 1 1 1 1 1 1 1 1 1 1 1 1 1 1 1 1 1 1 1 1 1 1 1 1 1
symmnumber: 1
zpe: 957878.7 jmol-1
zpe.correction: 0.364837 hartree
zpe.thermalcorrener: 0.385742 hartree
zpe.thermalcorrenthalpy: 0.386686 hartree
zpe.thermalcorrgfe: 0.313159 hartree
zpe.sumelectzpe: -1469.915536 hartree
zpe.sumelectthermal: -1469.894630 hartree
zpe.sumelectthermalent: -1469.893686 hartree
zpe.sumelectthermalfe: -1469.967213 hartree
dipole: -6.9138 -1.0690 -1.7853
dipole: 7.2202
quadrupole: -131.0734 -111.2974 -127.7427
quadrupole: -6.7879 -0.5844 -1.7898
quadrupole: -7.7022 12.0738 -4.3716 -6.7879 -0.5844 -1.7898
hfenergy: -1470.2803724 hartree
pointgroup: C01 [X(C12H25N2O2P1S1)]
dipole: 1.1862698 -2.3491686 1.0692932 debye
polarizability: 239.8685644|0.4732414|267.0137875|-7.1420428|-25.0617782|176.1215523 unknown
InChI: InChI=1S/C10H20N2P.C2H5O2S/c1-3-7-11(8-4-1)13-12-9-5-2-6-10-12;1-2-5(3)4/h1-10H2;2H2,1H3
charge 0 multiplicity 1
43 atoms
S  0.263832 2.111141 -0.075713
P  0.162521 -0.214215 1.698054
O  -0.906193 3.256141 0.239128
O  0.106933 1.334927 -1.562848
N  1.318891 -1.167602 0.80552
N  -1.412222 -0.60566 1.079423
C  1.468397 -1.339539 -0.666783
C  2.553849 -1.551809 1.563691
C  -2.555569 0.172464 1.648836
C  -1.815413 -1.518155 -0.015637
C  1.5787 -2.847047 -1.026954
C  3.247732 -2.769954 0.882861
C  -3.32099 0.956991 0.556578
C  -2.510099 -0.743699 -1.161752
C  2.210174 -3.646784 0.146898
C  -3.7317 0.031341 -0.612578
C  1.884023 3.195461 -0.334177
C  1.609215 4.191287 -1.458429
H  2.401766 -0.815161 -0.963002
H  0.66696 -0.798889 -1.197801
H  2.262571 -1.81415 2.59678
H  3.263917 -0.69834 1.615142
H  -2.172575 0.865414 2.420857
H  -3.232047 -0.55718 2.143056
H  -2.529571 -2.249454 0.423754
H  -0.939152 -2.080153 -0.368118
H  2.202128 -2.941952 -1.936932
H  0.586427 -3.268433 -1.276166
H  3.786745 -3.348798 1.655198
H  4.007954 -2.418997 0.158972
H  -2.684031 1.787956 0.199731
H  -4.217277 1.408449 1.025655
H  -2.823645 -1.46555 -1.940977
H  -1.780751 -0.03885 -1.60601
H  1.42087 -3.946508 0.862703
H  2.679229 -4.575886 -0.225666
H  -4.504997 -0.689799 -0.269752
H  -4.188258 0.633719 -1.419513
H  2.055239 3.668954 0.646987
H  2.669288 2.458099 -0.570434
H  2.496905 4.829802 -1.62901
H  1.370428 3.658407 -2.395131
H  0.753996 4.837913 -1.19564
