program: Gaussian 09
title: 000178586
version: EM64L-G09RevD.01
frameworkgroup: C1[X(C9H19N2OPS)]
method: RPBEPBE
basis: SDD
operation: Freq
keyword: #p
keyword: freq=noraman
keyword: PBEPBE/SDD
title: #p freq=noraman PBEPBE/SDD
converged: NO YES NO NO
title: Mulliken charges:
elementType: S P O N N C C C C C C C C C H H H H H H H H H H H H H H H H H H H
charge: -0.283503 0.875119 -0.474457 -0.507493 -0.522529 -0.275026 -0.315805 -0.310355 -0.293500 -0.447928 -0.434103 -0.441543 -0.441623 -0.478697 0.219731 0.240134 0.215517 0.262207 0.214984 0.239994 0.214124 0.260099 0.228195 0.218869 0.226952 0.221471 0.228242 0.224467 0.223645 0.221647 0.213468 0.231852 0.245843
chargesum: 0.00000
title: Mulliken charges with hydrogens summed into heavy atoms:
elementType: S P O N N C C C C C C C C C
charge: -0.283503 0.875119 -0.474457 -0.507493 -0.522529 0.184840 0.161919 0.144623 0.180722 -0.000864 0.014320 0.011165 0.003669 0.212467
polarizability: 1.60193382e+02 -6.51205493e-01 1.52011276e+02 -4.03595492e+00 8.09469250e+00 1.40983966e+02
1716.lowfreq: -24.2486 -7.1705 -3.1214 0.0021 0.0021 0.0026 18.8145 34.8897 37.7739
frequency: -11.3473 34.8017 37.2969 59.3765 66.3714 88.5438 105.8166 112.1133 128.2740 150.6189 184.6417 225.0610 238.6720 256.1783 275.4311 302.3920 327.2356 341.6451 392.3096 519.6713 561.4946 567.4608 581.8925 635.0405 733.7112 740.7879 835.5497 845.6664 865.5202 866.4053 908.8722 909.8736 918.9437 925.0118 965.1811 968.3921 974.6488 1010.2541 1025.7911 1077.0831 1088.1466 1110.9420 1115.0800 1124.1227 1127.4813 1132.8942 1134.2273 1160.7702 1161.6386 1170.3017 1177.9395 1219.2026 1223.7563 1233.9603 1238.6538 1298.3808 1298.7150 1307.9226 1309.5191 1321.0314 1327.6331 1332.9862 1337.2054 1420.8958 1458.0097 1463.3860 1466.2290 1471.6905 1472.5495 1474.9623 1485.9698 1493.3194 1496.3799 1500.5152 2942.7711 2959.5587 2961.9455 2965.1510 2976.3982 3006.7421 3008.0750 3009.1438 3011.4020 3019.3986 3037.9082 3056.1159 3065.5181 3074.3129 3074.4779 3086.1102 3089.4314 3095.8056 3105.9190
redmass: 2.7073 2.8410 2.8553 2.6845 2.9165 2.9354 2.0305 1.5548 3.4734 3.8218 5.3519 1.9417 2.3777 2.8117 3.8809 4.1039 4.2369 6.2577 7.3508 8.8848 1.8586 2.1351 6.2285 12.0191 2.4962 2.5443 1.6230 1.7379 1.8704 1.8794 2.3304 2.3950 1.5088 1.5357 1.8830 1.9562 4.4161 3.9735 2.8417 1.9183 1.9857 3.3906 1.2463 1.9770 1.8327 1.8328 2.0310 1.4023 1.4117 1.5689 1.7528 1.2327 1.2439 1.2689 1.2753 1.3272 1.3421 1.2367 1.2293 1.3849 1.3707 1.3715 1.3790 1.1137 1.0538 1.0901 1.0889 1.0917 1.0888 1.0522 1.0802 1.0788 1.0895 1.0869 1.0706 1.0566 1.0426 1.0568 1.0618 1.0644 1.0762 1.0643 1.0667 1.0856 1.0997 1.1042 1.0949 1.1017 1.1017 1.0995 1.1059 1.1000 1.1014
irintensity: 0.5540 0.1029 0.5664 0.3101 2.6893 4.2893 1.0717 1.5618 0.8564 2.6741 10.6458 1.5609 9.8113 12.9920 7.5502 1.0663 1.4385 6.4702 1.0042 50.2046 6.2544 20.7587 54.6232 137.3993 17.8885 8.6041 1.2914 1.0138 6.2900 4.3218 9.4390 1.9331 4.9913 8.5228 24.1740 33.7611 132.4799 89.4208 81.2588 40.0863 93.2392 56.9751 0.5243 9.8700 21.8112 14.1261 20.7680 8.1938 11.1353 6.8441 25.3119 0.1562 2.2938 12.4970 10.2994 3.1270 1.6784 2.3052 0.6817 6.8570 4.7045 3.2892 1.5418 6.1696 12.1395 9.9604 9.1194 12.7778 8.8099 13.3132 1.4269 2.7246 5.8881 4.9068 58.6385 17.8305 129.9643 31.1396 37.8168 23.8287 24.0989 34.5083 37.1390 34.8616 30.6826 32.1880 13.8143 30.6537 24.0288 34.1880 67.4899 37.7547 20.4383
temp: 298.150 k
press: 1.00000 atm
elementType: 16 15 8 7 7 6 6 6 6 6 6 6 6 6 1 1 1 1 1 1 1 1 1 1 1 1 1 1 1 1 1 1 1
symmnumber: 1
zpe: 732513.1 jmol-1
zpe.correction: 0.279000 hartree
zpe.thermalcorrener: 0.294930 hartree
zpe.thermalcorrenthalpy: 0.295874 hartree
zpe.thermalcorrgfe: 0.233943 hartree
zpe.sumelectzpe: -1277.219302 hartree
zpe.sumelectthermal: -1277.203371 hartree
zpe.sumelectthermalent: -1277.202427 hartree
zpe.sumelectthermalfe: -1277.264358 hartree
dipole: -0.7143 -3.0727 -2.2427
dipole: 3.8705
quadrupole: -88.4782 -98.2660 -105.7422
quadrupole: -1.2765 1.8390 -7.5334
quadrupole: 9.0173 -0.7705 -8.2467 -1.2765 1.8390 -7.5334
hfenergy: -1277.4983011 hartree
pointgroup: C01 [X(C9H19N2O1P1S1)]
dipole: -0.2249527 1.1219696 1.0047132 debye
polarizability: 159.7839856|-0.9621772|150.1083086|5.4377784|8.7191025|143.2963301 unknown
InChI: InChI=1S/C9H19N2OPS/c1-12-13(14,10-6-2-3-7-10)11-8-4-5-9-11/h2-9H2,1H3
charge 0 multiplicity 1
33 atoms
S  -0.22768 -1.863801 -2.131882
P  -0.123044 -0.853847 -0.300295
O  -0.070934 -1.926838 1.107127
N  -1.407456 0.271991 -0.116957
N  1.281117 0.066655 0.153996
C  -1.516978 1.198355 1.049073
C  -2.611879 0.315382 -0.990058
C  1.672303 1.222674 -0.720207
C  2.490278 -0.601174 0.722905
C  -2.947473 1.783283 0.910311
C  -3.246972 1.671019 -0.607442
C  3.213561 1.331358 -0.547844
C  3.506749 0.557346 0.765053
C  -0.891702 -3.148951 1.054357
H  -0.744221 1.988927 0.984579
H  -1.370733 0.660603 2.003675
H  -3.306146 -0.521834 -0.769588
H  -2.321642 0.242288 -2.051454
H  1.156985 2.139346 -0.374441
H  1.391985 1.046365 -1.77783
H  2.855058 -1.421433 0.06676
H  2.25544 -1.023677 1.711316
H  -3.009358 2.818292 1.287771
H  -3.666034 1.167007 1.481519
H  -4.326091 1.703742 -0.835803
H  -2.749971 2.489654 -1.159855
H  3.551723 2.380643 -0.509306
H  3.724595 0.839448 -1.395419
H  4.546997 0.193357 0.823885
H  3.309719 1.196862 1.644629
H  -1.94836 -2.923085 1.29374
H  -0.470807 -3.818896 1.820746
H  -0.828829 -3.62296 0.056138
