program: Gaussian 09
title: 000178585
version: EM64L-G09RevD.01
frameworkgroup: C1[X(C7H19N2OPS)]
method: RPBEPBE
basis: SDD
operation: Freq
keyword: #p
keyword: freq=noraman
keyword: PBEPBE/SDD
title: #p freq=noraman PBEPBE/SDD
converged: YES YES NO NO
title: Mulliken charges:
elementType: S P O N N C C C C C C C H H H H H H H H H H H H H H H H H H H
charge: -0.274248 0.846190 -0.492987 -0.643649 -0.714811 -0.294630 -0.262697 -0.337990 -0.358743 -0.675470 -0.675474 -0.478811 0.237672 0.209100 0.222318 0.222937 0.330424 0.334526 0.189395 0.223391 0.215277 0.192725 0.213424 0.207195 0.221294 0.214027 0.211471 0.221130 0.233881 0.247421 0.215711
chargesum: 0.00000
title: Mulliken charges with hydrogens summed into heavy atoms:
elementType: S P O N N C C C C C C C
charge: -0.274248 0.846190 -0.492987 -0.313225 -0.380285 0.152143 0.182558 0.074796 0.049258 -0.033556 -0.028846 0.218202
polarizability: 1.39242209e+02 3.82411412e+00 1.53315801e+02 -3.28730923e+00 9.17299043e+00 1.16068381e+02
1716.lowfreq: -14.7655 -9.5813 -3.0021 -0.0015 0.0016 0.0019 24.2415 36.1908 44.9055
frequency: 24.1035 35.9175 44.5128 51.0986 63.1382 75.9755 80.7341 96.8377 120.2086 154.4116 162.5359 210.3803 218.3350 221.8516 223.1159 253.7575 280.2277 305.5804 358.6576 408.9059 421.4728 464.6438 505.0630 524.3135 571.9948 635.1840 739.6657 747.3635 773.0006 839.6836 880.8414 884.2740 894.1989 900.4288 979.3102 1040.9484 1048.5226 1097.6053 1102.4581 1109.0267 1117.8899 1118.8815 1132.4689 1135.4425 1138.2624 1229.8145 1235.4042 1278.5511 1289.4438 1297.0879 1301.1941 1351.4247 1355.0223 1384.7851 1388.3197 1394.4166 1398.6238 1423.0119 1456.8839 1460.2460 1470.4074 1472.7350 1474.6456 1477.9531 1478.8815 1481.1177 1485.5065 1492.0749 2943.0717 2964.5197 2974.2275 2974.5011 2976.6226 2978.5578 2982.6356 3022.3741 3030.2464 3044.2855 3053.6402 3059.2747 3074.6949 3076.1362 3078.6860 3080.2843 3110.8721 3526.1454 3545.7354
redmass: 3.7353 1.8561 2.7316 3.4736 3.0224 2.1872 2.6270 1.0638 2.8141 4.6845 4.3405 1.9170 1.5601 1.3696 2.2977 3.0075 4.0672 3.5109 5.0718 6.7716 2.9827 3.3832 1.2786 1.5613 3.7921 8.3055 1.4439 1.0873 2.2377 2.2186 1.7809 1.2891 1.6938 1.5273 10.1804 3.2689 3.1710 3.4663 2.7096 2.2025 1.2761 2.5883 1.4073 1.5050 1.5730 1.2708 1.2587 1.1469 1.1544 1.2326 1.2237 1.3680 1.3935 1.2629 1.2117 1.2420 1.2572 1.1151 1.0542 1.0687 1.0630 1.0558 1.0535 1.0422 1.0426 1.0625 1.0773 1.0817 1.0670 1.0308 1.0524 1.0591 1.0479 1.0368 1.0634 1.0919 1.0965 1.1006 1.1021 1.1043 1.1019 1.1011 1.0992 1.0993 1.1015 1.0751 1.0764
irintensity: 0.2657 0.7769 0.3379 0.4868 2.5050 1.7230 2.7398 0.1564 1.0318 1.2912 5.8995 0.4722 4.6657 0.0972 6.5968 2.6427 3.4329 8.6639 5.2912 12.6308 15.0246 0.9903 66.6208 47.2880 98.4351 178.8230 46.0522 13.6580 46.7663 67.7165 13.5301 1.7042 10.2661 37.5715 187.3323 8.8454 4.8566 103.8915 35.2359 7.7897 3.5625 34.8204 9.6349 17.2393 23.7638 9.1101 11.3749 6.5531 12.0090 0.4591 0.3464 0.3108 0.6356 7.6024 1.5048 33.5403 53.3200 8.7570 10.4369 1.7036 3.7227 7.3326 9.6311 13.1640 11.1632 1.1831 14.8124 19.6955 47.8843 67.1502 1.6107 48.8547 41.3439 31.2509 55.3541 5.4728 2.7973 19.1126 2.0803 33.1412 74.6486 79.4128 40.3701 44.4126 18.6849 29.0938 26.0813
temp: 298.150 k
press: 1.00000 atm
elementType: 16 15 8 7 7 6 6 6 6 6 6 6 1 1 1 1 1 1 1 1 1 1 1 1 1 1 1 1 1 1 1
symmnumber: 1
zpe: 692442.2 jmol-1
zpe.correction: 0.263737 hartree
zpe.thermalcorrener: 0.281513 hartree
zpe.thermalcorrenthalpy: 0.282457 hartree
zpe.thermalcorrgfe: 0.215446 hartree
zpe.sumelectzpe: -1201.139365 hartree
zpe.sumelectthermal: -1201.121589 hartree
zpe.sumelectthermalent: -1201.120645 hartree
zpe.sumelectthermalfe: -1201.187656 hartree
dipole: -0.2567 3.5998 0.9450
dipole: 3.7306
quadrupole: -80.3501 -99.1869 -89.9202
quadrupole: 1.4792 1.9353 -7.5223
quadrupole: 9.4690 -9.3678 -0.1011 1.4792 1.9353 -7.5223
hfenergy: -1201.4031018 hartree
pointgroup: C01[X(C7H19N2O1P1S1)]
dipole: -0.2142628 1.3044152 0.6378584 debye
polarizability: 139.0640798|2.9877536|148.7000477|-2.4180279|15.7700413|120.8622631 unknown
InChI: InChI=1S/C7H19N2OPS/c1-4-6-8-11(12,10-3)9-7-5-2/h8-9H,4-7H2,1-3H3
charge 0 multiplicity 1
31 atoms
S  -0.038329 -2.664996 -1.819716
P  -0.246944 -1.082545 -0.474435
O  -1.264493 -1.428425 0.929102
N  -0.799499 0.325662 -1.302163
N  1.048673 -0.477127 0.502074
C  -1.081412 1.624495 -0.659047
C  2.329076 -0.059209 -0.107486
C  -2.558999 1.81727 -0.240853
C  3.119101 0.844458 0.861127
C  -2.794494 3.199765 0.405617
C  4.467842 1.294763 0.26012
C  -2.400557 -2.34706 0.741359
H  -0.428154 1.699091 0.230241
H  -0.778161 2.430925 -1.357035
H  2.9506 -0.933816 -0.399482
H  2.09745 0.497235 -1.035205
H  -1.191965 0.149133 -2.230321
H  1.10347 -0.90485 1.431817
H  -3.212024 1.700123 -1.129078
H  -2.828998 1.012306 0.469157
H  2.497295 1.723082 1.117834
H  3.300217 0.29521 1.807996
H  -2.169811 3.325499 1.30985
H  -2.543451 4.018943 -0.294808
H  -3.850103 3.325804 0.706198
H  5.108185 0.426094 0.018274
H  4.315815 1.871084 -0.671554
H  5.022603 1.937013 0.967334
H  -2.691014 -2.66088 1.756033
H  -2.101774 -3.224819 0.137517
H  -3.247343 -1.830427 0.250934
