program: Gaussian 09
title: 000178592
version: EM64L-G09RevD.01
frameworkgroup: C1[X(C11H23N2OPS)]
method: RPBEPBE
basis: SDD
operation: Freq
keyword: #p
keyword: freq=noraman
keyword: PBEPBE/SDD
title: #p freq=noraman PBEPBE/SDD
converged: YES YES NO NO
title: Mulliken charges:
elementType: S P O N N C C C C C C C C C C C H H H H H H H H H H H H H H H H H H H H H H H
charge: 0.391466 0.752564 -0.649888 -0.556637 -0.579240 -0.326815 -0.251013 -0.281557 -0.315434 -0.435234 -0.457189 -0.455088 -0.441019 -0.336033 -0.659065 -0.649191 0.242712 0.214253 0.214331 0.239416 0.242423 0.213655 0.234308 0.209973 0.274410 0.214516 0.206175 0.229517 0.220302 0.229225 0.222219 0.229523 0.241413 0.211993 0.269936 0.213519 0.222063 0.211928 0.241563
chargesum: 0.00000
title: Mulliken charges with hydrogens summed into heavy atoms:
elementType: S P O N N C C C C C C C C C C C
charge: 0.391466 0.752564 -0.649888 -0.556637 -0.579240 0.130150 0.202734 0.174520 0.128848 0.053692 -0.021497 -0.005561 0.010723 -0.094621 0.036382 0.026364
polarizability: 2.28503525e+02 -9.40637207e+00 2.05831611e+02 -7.12104695e+00 1.32835373e+00 1.53800885e+02
1716.lowfreq: -15.6778 -0.0017 -0.0010 0.0003 5.6450 6.9194 27.6146 36.1183 43.0363
frequency: 27.5024 36.0189 42.8663 54.0031 59.9944 77.3937 87.0499 98.8374 118.5444 129.6929 155.5440 175.7124 201.9046 218.9878 229.8843 236.2205 246.3376 261.5189 264.2943 283.3977 318.6382 335.5385 361.9718 462.4147 470.3534 485.6407 496.7636 562.6657 563.5649 720.0348 726.5791 767.9027 848.3100 854.5091 863.7351 866.6116 880.0435 912.3006 915.8065 917.7834 921.2251 931.8211 959.0668 966.9778 972.0853 1000.5876 1011.2434 1026.1144 1069.1689 1073.7861 1099.7772 1111.2068 1120.1005 1123.8605 1131.5378 1148.1380 1155.0216 1160.5007 1170.0226 1174.7487 1219.0588 1227.0729 1231.2705 1238.3612 1242.1998 1296.2685 1298.8447 1301.9026 1309.4265 1317.4872 1321.6260 1327.7308 1329.1854 1336.8378 1379.4331 1393.4763 1452.2041 1456.2363 1461.9119 1464.2043 1466.1472 1469.3412 1470.3165 1474.5514 1478.7478 1488.2833 1492.0419 1496.6771 2942.5833 2951.9976 2953.9580 2964.7754 2972.3284 2983.7945 2999.0582 3005.1787 3008.4021 3020.7512 3028.7540 3033.4670 3039.7298 3047.3479 3051.0892 3064.5091 3066.2007 3074.6719 3075.2848 3076.5235 3088.3511 3089.1522 3100.1162
redmass: 2.8847 3.0891 2.9626 3.8743 2.9620 4.5000 3.0035 4.4621 5.0251 3.5995 3.8290 4.5224 3.5989 2.7175 1.0363 2.1685 1.9126 1.6541 1.9504 3.1676 4.6364 4.1139 3.2799 4.4584 8.0218 3.3401 6.5304 1.8542 1.8508 2.4665 2.4943 14.8832 1.7139 1.7319 1.8461 1.8695 2.5304 2.3707 2.2771 1.7294 1.4958 1.1856 1.3266 1.6585 1.7756 3.9356 3.2829 1.2830 1.7502 1.7158 3.5502 2.2143 1.7376 3.1755 2.3699 1.4246 1.3253 1.8926 1.6935 1.6881 1.3185 1.2688 1.2718 1.2743 1.2864 1.3187 1.3508 1.4378 1.2396 1.2629 1.3313 1.3429 1.3046 1.3543 1.2228 1.1952 1.0868 1.0407 1.0829 1.0889 1.0708 1.0696 1.0804 1.0563 1.0794 1.0804 1.0571 1.0883 1.0671 1.0678 1.0378 1.0634 1.0363 1.0570 1.0656 1.0623 1.0661 1.0611 1.0865 1.0933 1.0994 1.1018 1.0963 1.0942 1.0975 1.1015 1.0997 1.1021 1.1001 1.1057 1.1065
irintensity: 0.5076 0.3354 0.2110 1.4154 0.5061 1.7163 0.7579 2.5312 7.1198 0.0873 2.3044 0.9142 1.2871 13.2002 0.0687 2.7554 3.6726 1.1312 0.3455 0.6474 40.8570 12.2417 16.8883 0.5117 10.1246 6.9191 11.5877 2.3423 1.5365 6.5034 3.2002 48.0219 1.2080 5.7779 8.0258 6.8100 1.4367 14.2064 2.4085 2.2824 0.4108 3.3686 0.3785 5.1109 5.3975 165.5639 86.4282 20.2275 40.4255 17.1551 9.4823 11.9157 19.0813 34.7486 0.6988 7.4933 3.6454 30.5557 15.7469 14.2808 23.2881 0.3940 1.9276 10.6259 5.0861 1.7969 3.7463 1.9363 0.5669 2.1326 3.2545 17.7234 9.2414 20.1484 25.6996 25.5192 19.8304 6.9618 9.3034 8.7299 8.9348 16.6369 3.3065 15.1063 3.0681 3.7293 18.9709 12.2154 74.9427 83.3353 39.4781 25.9534 56.7199 57.2966 48.4290 25.9360 24.4479 46.1295 8.2995 60.6659 7.6147 29.3730 6.8926 8.8846 37.3289 41.4589 34.8246 26.7136 29.3303 58.7014 35.9948
temp: 298.150 k
press: 1.00000 atm
elementType: 16 15 8 7 7 6 6 6 6 6 6 6 6 6 6 6 1 1 1 1 1 1 1 1 1 1 1 1 1 1 1 1 1 1 1 1 1 1 1
symmnumber: 1
zpe: 871735.1 jmol-1
zpe.correction: 0.332026 hartree
zpe.thermalcorrener: 0.352023 hartree
zpe.thermalcorrenthalpy: 0.352967 hartree
zpe.thermalcorrgfe: 0.281722 hartree
zpe.sumelectzpe: -1355.618677 hartree
zpe.sumelectthermal: -1355.598681 hartree
zpe.sumelectthermalent: -1355.597737 hartree
zpe.sumelectthermalfe: -1355.668981 hartree
dipole: -3.3827 -0.5828 1.6302
dipole: 3.8000
quadrupole: -107.5384 -104.1902 -116.7567
quadrupole: 1.0038 6.9692 -1.7834
quadrupole: 1.9567 5.3049 -7.2616 1.0038 6.9692 -1.7834
hfenergy: -1355.9507035 hartree
pointgroup: C01[X(C11H23N2O1P1S1)]
dipole: -0.5462011 1.2697137 0.5697466 debye
polarizability: 201.8812887|3.8569267|230.7239133|8.6433925|8.9036466|155.530819 unknown
InChI: InChI=1S/C8H16N2P.C3H7OS/c1-2-6-9(5-1)11-10-7-3-4-8-10;1-3(2)5-4/h1-8H2;3H,1-2H3
charge 0 multiplicity 1
39 atoms
S  -1.084545 -1.036438 -1.004633
P  -0.341859 0.516403 1.127449
O  0.383039 -1.862612 -1.220018
N  1.334202 0.166887 0.821498
N  -0.639661 2.080455 0.382631
C  1.975474 -0.997976 1.509325
C  2.199712 0.676947 -0.282872
C  -0.41031 2.495853 -1.032494
C  -1.638398 2.977348 1.048772
C  3.076016 -1.441803 0.522463
C  3.527726 -0.09996 -0.106877
C  -1.557838 3.491136 -1.322356
C  -1.794999 4.155495 0.057268
C  -2.217516 -2.316873 -0.004628
C  -1.313052 -3.094526 0.951387
C  -2.923182 -3.202497 -1.043796
H  1.244572 -1.800718 1.702168
H  2.409296 -0.670196 2.477757
H  2.336076 1.770595 -0.192946
H  1.739503 0.440014 -1.260454
H  -0.4305 1.618479 -1.70396
H  0.573297 2.994082 -1.145501
H  -1.276009 3.308681 2.038752
H  -2.612114 2.462341 1.195374
H  2.618552 -2.083182 -0.24927
H  3.897491 -1.981725 1.024627
H  4.204104 0.442305 0.580782
H  4.049075 -0.235552 -1.069562
H  -2.464183 2.946085 -1.645302
H  -1.292098 4.217355 -2.109544
H  -1.018979 4.918983 0.249513
H  -2.782881 4.639348 0.142001
H  -2.931589 -1.653277 0.516208
H  -1.809066 -4.022014 1.293601
H  -0.381432 -3.366577 0.413841
H  -1.044377 -2.493437 1.838679
H  -3.527839 -2.606789 -1.750635
H  -3.594292 -3.923415 -0.537231
H  -2.179017 -3.776924 -1.625115
