program: Gaussian 09
title: 000178568
version: EM64L-G09RevD.01
frameworkgroup: C1[X(C15H24FNSi)]
method: RPBEPBE
basis: SDD
operation: Freq
keyword: #p
keyword: freq=noraman
keyword: PBEPBE/SDD
title: #p freq=noraman PBEPBE/SDD
converged: YES YES NO NO
title: Mulliken charges:
elementType: Si F N C C C C C C C C C C C C C C C H H H H H H H H H H H H H H H H H H H H H H H H
charge: 1.269494 -0.212910 -0.074082 -0.745709 -0.339870 -0.383141 -0.948973 -0.438651 -0.384453 -0.408489 -1.034529 -1.007525 0.524091 -0.367530 -0.360584 -0.371883 -0.370413 0.308888 0.207830 0.223484 0.207988 0.187599 0.185750 0.210719 0.241431 0.239952 0.212727 0.202290 0.192241 0.207538 0.199662 0.215144 0.253266 0.229210 0.249144 0.225915 0.235117 0.249221 0.230297 0.235686 0.251929 0.252133
chargesum: 0.00000
title: Mulliken charges with hydrogens summed into heavy atoms:
elementType: Si F N C C C C C C C C C C C C C C C
charge: 1.269494 -0.212910 -0.074082 -0.314395 0.055716 0.013328 -0.467590 -0.023635 0.015325 0.006317 -0.302909 -0.297273 0.524091 -0.137233 -0.124899 -0.119954 -0.118280 0.308888
polarizability: 2.21651171e+02 -1.39323973e+01 1.86216145e+02 1.80845638e+01 9.11619329e+00 1.59332841e+02
1716.lowfreq: -6.9756 -0.0007 -0.0004 0.0004 7.2714 12.0378 16.2327 26.3541 38.3139
frequency: 15.0301 26.0669 38.2370 51.7652 58.9646 84.4002 95.9707 108.3432 126.4890 140.8763 154.5136 168.8546 178.9583 199.0024 223.9749 243.7773 257.6359 298.2594 311.7570 315.2785 355.8587 395.2628 411.8382 435.3682 459.4924 479.2799 516.2865 569.2428 593.5838 629.4793 651.0959 693.9948 705.1573 722.7676 734.1583 740.1770 756.1160 771.0173 781.0700 813.6576 818.7321 821.9593 843.6675 847.2804 865.3253 872.7011 894.7582 902.4679 923.2362 939.2982 953.8833 954.5223 988.2135 1005.1987 1045.5345 1077.8219 1083.4304 1108.9405 1121.8264 1132.5295 1152.0369 1153.6909 1164.2379 1171.1418 1178.6930 1195.3751 1216.1864 1235.1881 1236.9404 1256.3214 1270.3448 1286.2370 1293.4296 1294.5852 1302.3137 1322.4930 1325.7634 1341.8682 1356.2301 1371.4541 1377.1408 1406.8543 1436.4827 1440.6208 1446.3892 1447.9914 1454.7489 1458.9197 1460.3654 1470.2695 1471.6055 1475.7392 1491.7793 1492.6095 1598.3404 1610.5307 2817.0150 2830.1143 2843.3563 2974.3931 2982.1385 2982.2739 2983.1866 2984.9771 2985.9897 2991.8499 2997.2372 3025.8345 3042.9212 3044.3969 3044.8099 3063.5896 3080.8442 3086.1686 3092.8470 3095.3569 3128.4444 3132.6944 3169.7373 3172.6483
redmass: 4.7197 3.3374 3.8813 3.1525 3.6101 2.8508 2.6724 1.0452 4.2165 1.1117 2.3261 3.6210 2.7846 2.9819 2.1626 2.0524 2.4557 2.7528 3.8870 2.1178 5.7349 3.6361 2.9849 2.8666 5.4149 4.2189 3.1918 2.7858 2.6728 6.4302 3.7352 3.2321 2.5873 2.9264 4.1952 1.3441 1.7032 1.7327 1.8480 1.3459 1.4673 3.2356 1.6763 2.0111 1.7649 1.8078 1.5638 1.5644 2.2624 1.3617 1.4131 1.5649 1.9264 2.8116 2.2256 1.3723 1.6126 2.3344 3.0315 1.1047 2.2861 1.4997 1.2219 1.2941 1.2172 1.7417 5.1352 1.2327 1.3133 1.2334 1.3058 1.4655 1.2069 1.2784 1.1977 1.3467 1.3976 1.4109 1.3605 1.4068 6.2963 3.1563 1.0865 1.0727 1.0628 1.0807 1.0522 1.0756 1.0551 1.0938 1.0834 1.0803 2.6614 1.0909 7.5441 6.5279 1.0693 1.0723 1.0704 1.0863 1.0569 1.0596 1.0353 1.0356 1.0631 1.0848 1.0635 1.0903 1.0979 1.1010 1.1008 1.1041 1.0981 1.0985 1.0978 1.0969 1.0897 1.0895 1.0952 1.0959
irintensity: 0.2601 0.1622 0.0972 0.1409 0.1777 0.0941 0.1417 0.0853 0.2253 0.1307 0.6095 0.1298 1.2943 1.7926 1.2411 1.6891 3.0982 0.7651 3.1469 5.0046 11.1311 1.9168 0.0032 4.3509 8.5009 0.8479 28.2064 0.2305 6.7808 0.0704 0.9243 10.3254 2.6582 2.0526 33.8717 1.2178 1.2392 34.9866 14.2805 1.6664 0.4012 14.3055 31.0011 18.5832 23.4358 31.6554 187.0126 77.7940 17.4715 2.8160 2.5159 4.1147 1.8631 6.9393 6.5903 39.8415 5.8626 16.4284 4.4438 1.0081 21.5215 21.4216 2.8667 57.7230 7.2530 56.0714 4.3853 0.7754 9.5818 1.7274 4.0488 11.3590 42.7375 3.6451 33.1171 1.6761 1.7713 0.6565 1.3648 5.5381 1.4124 0.7808 4.7525 1.0172 7.5248 6.0407 6.9674 6.3461 10.4897 10.8550 10.1691 0.3488 153.7741 2.8243 3.5619 3.5952 58.5279 71.4434 157.7184 34.4712 14.1754 42.0286 12.5933 20.7349 49.9055 21.5308 59.7093 37.3933 25.9327 7.5464 49.1218 96.0287 15.0083 19.0092 10.9880 29.7406 14.1265 14.2748 6.6310 2.4200
temp: 298.150 k
press: 1.00000 atm
elementType: 14 9 7 6 6 6 6 6 6 6 6 6 6 6 6 6 6 6 1 1 1 1 1 1 1 1 1 1 1 1 1 1 1 1 1 1 1 1 1 1 1 1
symmnumber: 1
zpe: 931485.0 jmol-1
zpe.correction: 0.354784 hartree
zpe.thermalcorrener: 0.375343 hartree
zpe.thermalcorrenthalpy: 0.376287 hartree
zpe.thermalcorrgfe: 0.303330 hartree
zpe.sumelectzpe: -1028.585888 hartree
zpe.sumelectthermal: -1028.565330 hartree
zpe.sumelectthermalent: -1028.564385 hartree
zpe.sumelectthermalfe: -1028.637342 hartree
dipole: -2.3199 1.1631 -0.2712
dipole: 2.6093
quadrupole: -131.5278 -115.0362 -115.3056
quadrupole: 9.6056 -2.7951 4.7541
quadrupole: -10.9046 5.5870 5.3176 9.6056 -2.7951 4.7541
hfenergy: -1028.9406723 hartree
pointgroup: C01 [X(C15H24F1N1Si1)]
dipole: 0.9144009 -0.4643529 0.0458659 debye
polarizability: 222.496515|-17.7392662|179.1979017|-12.070238|-15.3574576|165.5057399 unknown
InChI: InChI=1S/C15H24FNSi/c1-18(2,13-17-10-4-3-5-11-17)12-14-6-8-15(16)9-7-14/h6-9H,3-5,10-13H2,1-2H3
charge 0 multiplicity 1
42 atoms
Si 0.421459 -1.602649 0.225867
F  -5.268876 2.081855 0.047948
N  2.521693 0.335666 -0.232868
C  1.061327 0.129591 -0.365747
C  2.979285 0.322277 1.184214
C  3.025144 1.528758 -0.960564
C  -1.242596 -1.951404 -0.726593
C  4.407449 0.912861 1.328346
C  4.56542 1.435081 -1.145803
C  5.220981 0.671164 0.03897
C  0.047566 -1.632673 2.105086
C  1.669848 -2.968969 -0.25501
C  -2.314287 -0.89751 -0.531468
C  -2.436068 0.199836 -1.427975
C  -3.218851 -0.964107 0.56436
C  -3.415916 1.200671 -1.24448
C  -4.207725 0.02385 0.768716
C  -4.281471 1.089062 -0.143915
H  0.467211 0.929518 0.1532
H  0.802033 0.204065 -1.441911
H  2.971126 -0.728163 1.538948
H  2.272539 0.892652 1.842007
H  2.753207 2.477852 -0.429237
H  2.527488 1.569268 -1.946638
H  -1.603694 -2.942544 -0.388438
H  -0.98669 -2.055192 -1.799089
H  4.905019 0.460849 2.206508
H  4.351863 2.002217 1.521277
H  4.980726 2.459429 -1.220641
H  4.799545 0.916413 -2.093695
H  6.271213 0.992803 0.171511
H  5.234008 -0.412834 -0.17927
H  -0.737017 -0.897039 2.360342
H  -0.306445 -2.633129 2.417637
H  0.945795 -1.390904 2.700388
H  1.344163 -3.958409 0.116162
H  1.779685 -3.029467 -1.353186
H  2.668412 -2.750762 0.16353
H  -1.761294 0.268915 -2.289367
H  -3.155649 -1.806184 1.263508
H  -3.514078 2.042723 -1.936041
H  -4.908149 -0.029138 1.607511
