program: Gaussian 09
title: 000178597
version: EM64L-G09RevD.01
frameworkgroup: C1[X(C14H20N3O3PS)]
method: RPBEPBE
basis: SDD
operation: Freq
keyword: #p
keyword: freq=noraman
keyword: PBEPBE/SDD
title: #p freq=noraman PBEPBE/SDD
converged: YES YES NO NO
title: Mulliken charges:
elementType: S P O O O N N N C C C C C C C C C C C C C C H H H H H H H H H H H H H H H H H H H H
charge: -0.021665 1.107548 -0.601814 -0.218730 -0.222544 -0.580689 -0.525620 0.020805 -0.267965 -0.296468 -0.319730 -0.309579 -0.447648 -0.443521 -0.440894 -0.440612 -0.211460 -0.155640 -0.201600 -0.368396 -0.345371 0.376494 0.213719 0.246936 0.241681 0.250988 0.224003 0.250075 0.240858 0.250028 0.231818 0.227741 0.236421 0.224600 0.233983 0.229696 0.239001 0.222540 0.323026 0.255497 0.286835 0.285654
chargesum: 0.00000
title: Mulliken charges with hydrogens summed into heavy atoms:
elementType: S P O O O N N N C C C C C C C C C C C C C C
charge: -0.021665 1.107548 -0.601814 -0.218730 -0.222544 -0.580689 -0.525620 0.020805 0.192690 0.196200 0.154348 0.181307 0.011911 0.017500 0.022785 0.020929 -0.211460 0.167386 0.053897 -0.081561 -0.059717 0.376494
polarizability: 3.79511457e+02 6.13493655e+00 1.81329686e+02 4.86222329e+00 6.41760568e-01 1.98685736e+02
1716.lowfreq: -13.2399 0.0010 0.0011 0.0018 4.7682 6.8733 12.2892 22.8566 33.2245
frequency: 10.9257 22.2934 33.0732 35.5067 48.8113 62.1620 67.7358 74.4914 91.4347 94.6285 124.9646 132.8718 164.8458 172.6404 200.5261 231.1060 238.3503 251.1259 268.3011 278.8081 292.1688 298.3336 312.8916 340.4432 409.7482 417.4977 470.8642 473.4326 505.3555 509.5120 529.1546 562.4229 563.7006 621.0952 663.7842 688.1818 717.7854 723.9298 736.2999 786.9933 843.5508 848.2560 854.5817 863.3828 864.7923 868.2939 911.4649 913.4306 915.2607 923.1608 957.8481 966.9183 978.2568 982.9368 997.2207 1004.0841 1017.5432 1038.8134 1064.1800 1075.2223 1087.4580 1094.2353 1101.7681 1110.1736 1122.3123 1124.4678 1132.8641 1156.4255 1161.0689 1176.1784 1178.1415 1185.6073 1224.3267 1227.8379 1230.6027 1235.5270 1243.3302 1300.1947 1301.4374 1301.8200 1311.5614 1313.5994 1322.8428 1333.4374 1336.7232 1339.1900 1349.1029 1383.6263 1415.0068 1462.4063 1465.5023 1466.6955 1470.1936 1472.1405 1483.7397 1494.8035 1495.5617 1501.7932 1578.1007 1586.3859 2963.8102 2973.9430 2982.4221 2990.0557 3010.9686 3011.8223 3012.4482 3012.5830 3036.0145 3049.0077 3054.2633 3065.8337 3079.9892 3082.0494 3094.4100 3095.3827 3136.2030 3150.7530 3180.6697 3184.0229
redmass: 5.3585 4.9888 3.5505 3.1952 3.7929 3.3804 4.7154 6.2016 5.0488 4.3807 3.9297 4.8245 9.5670 4.6791 5.0855 2.4929 5.6084 1.7215 3.4685 4.5897 4.7694 4.6914 13.4092 7.5547 3.1489 7.4030 7.0105 4.3197 8.7363 7.7252 8.2901 1.8654 1.8441 7.1420 5.2526 8.7859 2.6253 4.7196 2.4368 9.3641 1.3263 1.6835 1.6961 1.8866 1.8669 1.4255 2.2768 2.4730 1.5808 1.4378 2.5688 1.7141 2.8972 1.3532 2.5283 1.6698 3.7828 2.8259 3.9948 1.8261 1.9387 2.9400 5.8099 1.3386 2.1677 2.6730 1.8152 1.3198 1.3984 1.8640 1.6448 1.5485 3.6478 1.2717 1.2866 1.2842 1.2489 1.3323 1.3083 1.3251 1.2394 1.2519 1.3442 1.3327 1.3674 1.3538 6.0173 8.8235 4.1337 2.0510 1.0885 1.0889 1.0889 1.0922 1.0816 1.0848 1.0789 1.0860 7.8882 5.9848 1.0652 1.0601 1.0615 1.0647 1.0659 1.0602 1.0635 1.0667 1.1010 1.1014 1.0971 1.0995 1.1019 1.1015 1.1059 1.1058 1.0937 1.0900 1.0939 1.0957
irintensity: 0.6458 0.0804 0.2312 0.0289 0.2373 0.5443 1.1621 0.5001 0.9630 2.2921 1.6007 1.2003 2.7221 13.5129 17.3560 3.9048 2.4001 0.8417 3.2295 1.9885 7.7353 6.4086 5.3604 4.4708 1.6426 69.2537 206.4643 73.8875 36.0901 12.2377 37.9647 0.1991 3.3531 0.4777 20.5455 2.0546 10.7911 6.8436 5.6923 34.9042 12.6513 7.3155 3.9375 11.7294 0.9708 43.7922 16.4169 5.8053 0.9827 1.0859 23.3072 3.8618 36.0500 2.0187 1.5777 21.1734 137.1280 50.5742 105.3052 60.9066 107.1762 4.2113 33.5133 16.5729 44.9640 23.2329 42.9673 2.9588 16.8958 53.7649 17.9229 210.6757 465.7651 6.5981 0.7476 15.0560 7.9233 3.0293 2.3707 0.9202 0.5871 0.2610 5.4661 5.7898 4.9292 13.5062 59.4835 50.4008 35.7874 26.7869 9.4886 9.0765 12.2904 11.4496 7.8142 4.6729 2.0596 13.2420 6.7692 220.1729 31.1789 91.5845 28.8124 16.2599 19.4722 22.2277 36.4388 34.9729 8.9003 19.3451 18.0855 20.6511 31.9962 23.8508 52.5295 47.3163 17.0290 2.9217 0.4534 1.5133
temp: 298.150 k
press: 1.00000 atm
elementType: 16 15 8 8 8 7 7 7 6 6 6 6 6 6 6 6 6 6 6 6 6 6 1 1 1 1 1 1 1 1 1 1 1 1 1 1 1 1 1 1 1 1
symmnumber: 1
zpe: 870655.5 jmol-1
zpe.correction: 0.331615 hartree
zpe.thermalcorrener: 0.354232 hartree
zpe.thermalcorrenthalpy: 0.355177 hartree
zpe.thermalcorrgfe: 0.275465 hartree
zpe.sumelectzpe: -1672.942938 hartree
zpe.sumelectthermal: -1672.920321 hartree
zpe.sumelectthermalent: -1672.919377 hartree
zpe.sumelectthermalfe: -1672.999088 hartree
dipole: -10.4033 2.5826 -3.0067
dipole: 11.1327
quadrupole: -172.5483 -132.7920 -148.7592
quadrupole: 2.3865 -4.1403 0.0321
quadrupole: -21.1818 18.5745 2.6073 2.3865 -4.1403 0.0321
hfenergy: -1673.2745535 hartree
pointgroup: C01 [X(C14H20N3O3P1S1)]
dipole: 3.9912679 1.6945287 0.6183776 debye
polarizability: 378.1169298|16.609655|183.2146994|-7.7657951|2.7414844|198.1952498 unknown
InChI: InChI=1S/C8H16N2OP.C6H4NO2S/c11-12(9-5-1-2-6-9)10-7-3-4-8-10;8-7(9)5-1-3-6(10)4-2-5/h1-8H2;1-4H
charge 0 multiplicity 1
42 atoms
S  0.556724 -0.767733 1.465767
P  1.665677 -0.150187 -0.597361
O  0.991031 -0.880125 -1.855342
O  -5.800402 -1.407776 -0.955521
O  -6.234939 -0.694711 1.169246
N  3.260826 -0.563653 -0.124975
N  1.671605 1.57299 -0.716607
N  -5.418153 -1.023156 0.219528
C  4.44799 0.339774 -0.162311
C  3.636971 -1.987088 0.136325
C  1.918225 2.45522 0.466571
C  0.774303 2.23967 -1.720817
C  5.630586 -0.653147 -0.259761
C  5.128093 -1.885085 0.535517
C  0.891129 3.598862 0.293935
C  0.750708 3.711404 -1.245491
C  -1.215108 -0.817737 1.009272
C  -1.674031 -1.249565 -0.264576
C  -2.14964 -0.456937 2.019594
C  -3.055427 -1.308732 -0.525553
C  -3.531005 -0.531001 1.768882
C  -3.969916 -0.953066 0.492656
H  4.517752 0.939859 0.767715
H  4.389504 1.03282 -1.019665
H  3.503756 -2.596035 -0.779248
H  3.009971 -2.42075 0.93584
H  2.954307 2.845211 0.43856
H  1.778103 1.892662 1.409018
H  -0.239627 1.794654 -1.704418
H  1.180488 2.117209 -2.738846
H  6.562322 -0.226585 0.149373
H  5.807553 -0.927488 -1.315663
H  5.681815 -2.807669 0.293842
H  5.219676 -1.702362 1.621758
H  1.228714 4.537258 0.765142
H  -0.076206 3.311488 0.745149
H  -0.174672 4.223694 -1.557162
H  1.609735 4.263718 -1.668575
H  -0.952172 -1.518567 -1.043352
H  -1.789005 -0.119633 2.996652
H  -3.434731 -1.634217 -1.497841
H  -4.267532 -0.263386 2.530943
