program: Gaussian 09
title: 000178565
version: EM64L-G09RevD.01
frameworkgroup: C1[X(C18H28N2O3)]
method: RPBEPBE
basis: SDD
operation: Freq
keyword: #p
keyword: freq=noraman
keyword: PBEPBE/SDD
title: #p freq=noraman PBEPBE/SDD
converged: YES YES NO NO
title: Mulliken charges:
elementType: O O O N N C C C C C C C C C C C C C C C C C C H H H H H H H H H H H H H H H H H H H H H H H H H H H H
charge: -0.283770 -0.307618 -0.308454 -0.397506 -0.392662 -0.240970 -0.010093 0.189804 -0.181091 -0.705343 -0.719699 0.479904 -0.702734 0.272153 -0.448193 -0.389463 0.433616 -0.379788 -0.395554 0.047737 -0.804015 -0.684931 -0.687686 0.274874 0.187066 0.252415 0.208846 0.225670 0.233310 0.233905 0.211313 0.224606 0.326223 0.351070 0.258590 0.207143 0.226670 0.237217 0.236567 0.232355 0.231285 0.230204 0.238327 0.225874 0.226297 0.216856 0.252455 0.208113 0.221848 0.232711 0.204544
chargesum: 0.00000
title: Mulliken charges with hydrogens summed into heavy atoms:
elementType: O O O N N C C C C C C C C C C C C C C C C C C
charge: -0.283770 -0.307618 -0.308454 -0.071283 -0.041592 0.033904 0.176973 0.189804 0.071324 -0.037517 -0.049874 0.479904 -0.010331 0.272153 -0.210975 -0.152896 0.433616 -0.147434 -0.164269 0.277941 -0.113517 -0.007506 -0.028583
polarizability: 2.94944575e+02 2.63425897e+01 1.82010916e+02 -6.33206074e+00 -1.51667449e+00 1.90497915e+02
1716.lowfreq: -31.9214 -9.6688 -1.4823 -0.0010 0.0002 0.0005 5.6110 10.3047 16.3890
frequency: -31.7882 -4.4895 16.3165 23.8294 32.8586 41.6505 50.9154 63.6873 80.9895 87.6063 91.9554 99.0759 135.0366 148.2193 178.8021 190.1061 196.7116 206.1931 218.3771 227.3891 239.4594 244.8225 247.3128 274.0034 283.9987 300.0577 321.7284 344.2364 355.0205 380.7098 390.6433 402.1090 405.6225 438.2399 478.2245 490.5986 532.3537 539.0406 546.1162 605.0628 637.0608 641.3437 653.3492 689.5629 700.7356 711.4780 729.0683 772.8939 791.6182 814.9774 827.1908 833.2854 850.9709 892.5202 900.5130 916.9797 923.9377 939.1301 941.1131 952.5750 959.5731 965.8033 974.2766 984.4065 992.2950 1011.9678 1030.2712 1047.9239 1066.3610 1079.2046 1097.1439 1106.3004 1116.4819 1131.7658 1155.4837 1163.2638 1179.9682 1189.2249 1193.0313 1204.9655 1210.7873 1216.0668 1223.8809 1251.8229 1288.1975 1303.5257 1312.5197 1320.9280 1328.5483 1338.8247 1343.2641 1352.0141 1377.7136 1377.8877 1382.3515 1387.2169 1394.3719 1396.9862 1400.5445 1407.4050 1456.3010 1457.9458 1458.1657 1463.9354 1469.4108 1471.5095 1472.3324 1473.1735 1473.5409 1478.4805 1481.0987 1485.2418 1488.0187 1488.9958 1510.2312 1583.2034 1602.7559 1625.1001 1645.2027 2957.3264 2976.5330 2979.6900 2982.9248 2986.8019 2991.3549 2991.5957 2998.5527 3017.6682 3024.8010 3057.9591 3074.2345 3077.9209 3079.9054 3082.0203 3086.3732 3088.0753 3090.0175 3091.9586 3097.6796 3101.3622 3102.9418 3113.3378 3116.6192 3135.4269 3142.0876 3497.8599 3539.4192
redmass: 1.0337 3.6343 4.0484 4.1309 3.1789 3.7628 3.5923 2.9961 4.2541 4.0511 6.7302 4.3589 3.8964 4.2886 3.5986 2.9177 1.0503 1.0901 2.4972 2.9219 1.1084 1.1887 1.3824 4.0382 3.2345 3.3701 3.5010 3.2347 2.8030 3.7848 2.6242 3.1450 2.8256 2.7680 3.1996 2.9067 2.1577 1.5449 2.9368 2.6970 5.4891 4.7589 1.6244 4.7348 6.8374 3.7438 2.9875 4.0220 4.0774 3.3646 1.6971 3.0720 1.2488 2.5408 2.4964 1.1921 1.2333 2.2874 1.3610 1.3968 1.6895 2.6226 1.3889 1.4198 3.3295 3.0659 1.7035 1.5689 1.8891 2.9603 2.1594 1.7745 2.2347 1.3749 2.0667 2.8990 1.9830 2.1417 1.1175 1.6257 1.9957 1.9544 2.8377 1.4041 1.5714 1.5529 1.4434 1.4295 1.6678 1.3270 1.2169 1.3849 3.8639 1.2784 1.2066 1.2392 1.2339 1.2230 1.2110 2.6969 1.0715 1.0515 1.3782 1.0635 1.3619 1.0966 1.0608 1.0542 1.1181 1.0544 1.0547 1.6103 1.0712 1.1065 2.6698 6.0257 6.9269 6.4408 9.2651 1.0824 1.0385 1.0353 1.0363 1.0355 1.0355 1.0357 1.0838 1.0848 1.0864 1.0951 1.1000 1.0999 1.0993 1.0993 1.0998 1.0998 1.0998 1.0988 1.1006 1.1007 1.1005 1.0868 1.0873 1.0961 1.0973 1.0763 1.0781
irintensity: 0.4558 0.1678 0.2121 0.6957 0.4378 0.4906 1.0797 1.2752 2.2892 0.8346 9.7516 0.1418 2.5125 0.5689 2.4235 5.5642 0.0577 0.0884 20.0321 3.5424 0.3579 0.1254 9.7604 7.8358 1.0085 2.8585 8.7275 2.8402 2.0211 7.7120 1.5652 4.2403 0.0897 1.0119 12.8420 0.8940 17.3094 68.9293 19.0481 25.7766 9.4926 8.3108 68.5703 2.4056 10.9345 41.6098 2.0862 11.7913 12.2907 12.0060 44.3928 21.6927 0.2441 0.9071 8.0734 4.0933 2.5925 10.1053 1.3293 1.0115 2.1271 57.7016 0.1959 3.0181 131.5745 5.5582 1.9920 22.9605 80.9158 14.5615 62.9097 148.3190 0.8983 8.3344 16.6015 66.6436 63.1267 19.0439 6.5710 56.4032 3.9272 48.5593 1.9753 32.8914 33.3630 47.7429 1.0756 13.1812 11.7203 14.9305 4.0976 18.1594 6.2088 30.6907 22.2665 17.5313 28.9223 10.3803 19.2189 4.4901 42.1067 9.3284 475.2769 14.3080 320.4691 14.6346 8.5277 17.0332 107.6697 32.8369 12.1101 49.4278 30.7454 9.5019 19.4927 9.6107 177.5261 4.4675 234.1116 37.6198 35.2475 24.8327 25.3497 18.2992 19.7727 28.1709 23.2150 6.6054 7.8156 21.0736 0.5030 33.4294 71.9579 6.1014 16.3599 34.1030 28.6283 60.0690 19.1785 24.8991 34.4835 10.1865 17.1558 37.8014 1.9458 95.4353 24.0579
temp: 298.150 k
press: 1.00000 atm
elementType: 8 8 8 7 7 6 6 6 6 6 6 6 6 6 6 6 6 6 6 6 6 6 6 1 1 1 1 1 1 1 1 1 1 1 1 1 1 1 1 1 1 1 1 1 1 1 1 1 1 1 1
symmnumber: 1
zpe: 1132630.6 jmol-1
zpe.correction: 0.431396 hartree
zpe.thermalcorrener: 0.456235 hartree
zpe.thermalcorrenthalpy: 0.457179 hartree
zpe.thermalcorrgfe: 0.374871 hartree
zpe.sumelectzpe: -1036.163811 hartree
zpe.sumelectthermal: -1036.138972 hartree
zpe.sumelectthermalent: -1036.138028 hartree
zpe.sumelectthermalfe: -1036.220336 hartree
dipole: 3.6001 1.0537 -0.8336
dipole: 3.8427
quadrupole: -113.4814 -140.5405 -141.7417
quadrupole: 5.5537 -4.4769 5.9407
quadrupole: 18.4398 -8.6193 -9.8205 5.5537 -4.4769 5.9407
hfenergy: -1036.595207 hartree
pointgroup: C01 [X(C18H28N2O3)]
dipole: 1.4279845 0.3794723 -0.3201206 debye
polarizability: 296.3775362|23.1566196|180.6379967|-5.8791993|-1.4974505|190.4378733 unknown
InChI: InChI=1S/C18H28N2O3/c1-11(2)16(20-18(22)23-12(3)4)17(21)19-14(6)15-9-7-13(5)8-10-15/h7-12,14,16,19-20H,1-6H3
charge 0 multiplicity 1
51 atoms
O  -0.609386 -1.197677 1.519528
O  -4.803672 -0.264492 0.172883
O  -3.664145 0.723969 -1.647819
N  0.97801 -0.474209 -0.016552
N  -2.597295 0.230778 0.389085
C  -1.249904 0.601166 -0.044625
C  -0.832425 2.055085 0.386011
C  -0.275438 -0.445338 0.547293
C  2.059004 -1.368113 0.489762
C  -1.782133 3.102071 -0.238394
C  -0.767128 2.209236 1.922134
C  3.41676 -0.75895 0.141965
C  1.866042 -2.810789 -0.036618
C  -3.673002 0.275001 -0.46723
C  4.215325 -0.162875 1.148231
C  3.901333 -0.747584 -1.191719
C  5.950653 0.434305 -0.496681
C  5.462396 0.421099 0.835011
C  5.144482 -0.156443 -1.504224
C  -6.078634 -0.248578 -0.621459
C  7.3052 1.035539 -0.829373
C  -6.718418 1.14426 -0.522451
C  -6.934821 -1.368674 -0.024812
H  -1.229734 0.559536 -1.151792
H  0.186606 2.221256 -0.026238
H  1.938981 -1.394182 1.589072
H  -1.410334 4.123523 -0.035762
H  -2.794131 3.016155 0.196748
H  -1.879638 2.969427 -1.330227
H  -0.033878 1.521441 2.380518
H  -0.482731 3.242925 2.190597
H  -1.755457 2.002262 2.372405
H  1.198753 0.152338 -0.793748
H  -2.663236 -0.319086 1.252713
H  0.875376 -3.185607 0.270863
H  1.932357 -2.854366 -1.138175
H  2.641473 -3.476284 0.382565
H  3.856454 -0.155203 2.18476
H  3.313933 -1.211532 -1.993917
H  6.063538 0.874099 1.63282
H  5.498027 -0.156901 -2.54269
H  -5.810165 -0.463664 -1.672757
H  8.106284 0.274682 -0.753315
H  7.330213 1.435089 -1.85845
H  7.565763 1.855427 -0.137272
H  -6.925895 1.400363 0.531972
H  -6.05049 1.907572 -0.955749
H  -7.672842 1.163391 -1.080526
H  -7.154636 -1.165805 1.038324
H  -6.413623 -2.33872 -0.093415
H  -7.892373 -1.443823 -0.571471
