program: Gaussian 09
title: 000178513
version: EM64L-G09RevD.01
frameworkgroup: C1[X(C5H11NO3)]
method: RPBEPBE
basis: SDD
operation: Freq
keyword: #p
keyword: freq=noraman
keyword: PBEPBE/SDD
title: #p freq=noraman PBEPBE/SDD
converged: YES YES NO NO
title: Mulliken charges:
elementType: O O O N C C C C C H H H H H H H H H H H
charge: -0.459706 -0.199528 -0.220048 0.110758 -0.048420 -0.079180 -0.377168 -0.711467 -0.692862 0.261900 0.223985 0.220300 0.252951 0.213125 0.245409 0.236345 0.224729 0.217502 0.228460 0.352914
chargesum: 0.00000
title: Mulliken charges with hydrogens summed into heavy atoms:
elementType: O O O N C C C C C
charge: -0.106792 -0.199528 -0.220048 0.110758 0.213481 0.144804 0.096083 -0.016587 -0.022171
polarizability: 7.55165853e+01 1.39093492e+00 7.31117159e+01 2.04644906e+00 1.77482559e+00 6.84263178e+01
1716.lowfreq: -10.8589 -6.2712 -0.0013 -0.0011 -0.0010 10.9716 38.4815 61.3667 87.3706
frequency: 38.4799 61.3450 87.2359 162.4090 169.9291 196.7590 217.8454 228.9630 280.3519 318.9818 358.8231 412.9138 450.7686 493.1049 653.3138 666.8293 770.5994 845.4232 854.9972 888.8469 946.5322 1033.9708 1050.2309 1067.7215 1077.9204 1112.0077 1145.3545 1210.1854 1225.6821 1254.9733 1271.6759 1291.0920 1313.6936 1342.6543 1374.0508 1395.7903 1402.4718 1422.8965 1464.9138 1468.4534 1475.6914 1479.2369 1484.7181 2979.1840 2983.2942 2983.9232 3007.2550 3061.7637 3071.2403 3073.8472 3084.4282 3090.8370 3096.0858 3575.4984
redmass: 10.3021 3.6776 2.2723 4.2099 3.0209 1.2764 1.0599 1.1445 2.2520 4.6332 3.9247 3.1083 3.0143 3.8307 2.9644 8.4613 2.2191 1.7062 2.8316 2.1061 2.0734 2.0278 1.5152 2.0181 2.3245 2.0294 2.4048 2.1326 1.3148 2.7046 1.2751 1.2244 1.2343 1.5179 1.6242 1.2356 1.2124 3.6111 1.0911 1.0821 1.0438 1.0541 1.0457 1.0770 1.0437 1.0367 1.0624 1.0946 1.0921 1.0973 1.0988 1.1006 1.1001 1.0664
irintensity: 0.0468 4.9740 0.3142 7.3827 1.6741 2.3121 140.3333 6.4681 4.0941 4.3261 0.5750 5.2792 2.1612 10.3593 11.6026 6.2842 22.6725 5.9028 13.9104 10.4675 27.0865 4.8455 74.3400 11.6001 10.0810 5.2280 22.4966 27.0048 25.0223 33.5543 14.5375 13.5572 0.6963 4.1027 19.0057 22.2893 9.1024 114.0292 5.5555 8.3110 15.0206 13.2064 15.4703 27.7868 23.4622 13.9953 11.4955 5.0962 1.2597 26.4370 34.0171 25.1898 27.5851 5.8466
temp: 298.150 k
press: 1.00000 atm
elementType: 8 8 8 7 6 6 6 6 6 1 1 1 1 1 1 1 1 1 1 1
symmnumber: 1
zpe: 427528.6 jmol-1
zpe.correction: 0.162837 hartree
zpe.thermalcorrener: 0.173818 hartree
zpe.thermalcorrenthalpy: 0.174762 hartree
zpe.thermalcorrgfe: 0.125828 hartree
zpe.sumelectzpe: -476.723028 hartree
zpe.sumelectthermal: -476.712047 hartree
zpe.sumelectthermalent: -476.711103 hartree
zpe.sumelectthermalfe: -476.760038 hartree
dipole: 2.8505 2.3786 0.0729
dipole: 3.7133
quadrupole: -46.3209 -61.9335 -57.6848
quadrupole: -4.6317 1.2788 1.1453
quadrupole: 8.9922 -6.6204 -2.3718 -4.6317 1.2788 1.1453
hfenergy: -476.8858651 hartree
pointgroup: C01 [X(C5H11N1O3)]
dipole: 1.2034997 0.8281777 -0.0052784 debye
dipolederiv: -0.4237478 -0.2642289 0.1344313 -0.2107623 -0.7324067 -0.0407157 0.181112 -0.0249647 -0.489356 -0.2858493 -0.1760105 -0.1376215 -0.1869445 -0.4852666 -0.227374 -0.0491486 -0.0481898 -0.6322722 -0.2875824 -0.1127982 0.056683 -0.1119128 -0.4282651 0.1412234 -0.0490179 -0.0494538 -0.7282231 0.2494639 0.4073771 0.0676891 0.4449384 0.7047632 0.058177 0.0742496 0.0546659 1.1106175 0.0239508 -0.0823471 -0.0110029 -0.0428096 0.0223687 0.0023747 -0.0656965 -0.0460154 0.1028504 0.5738656 0.2040399 -0.0983475 0.1604067 0.5190508 -0.0046176 -0.0561223 0.0553055 0.3403723 0.0044866 -0.0760496 0.005719 -0.0599625 0.0915354 -0.0158105 0.0143788 0.0390363 0.0867606 -0.0723871 0.1064565 0.044627 0.0294687 -0.1711816 -0.0233269 0.0492186 -0.0430314 0.0366712 -0.0405961 0.0400304 -0.0352551 0.0545745 0.0302387 -0.010824 -0.0271584 -0.0234646 0.0699261 0.0605856 -0.0304141 -0.0044592 -0.0148984 0.0246664 -0.0210621 0.0165938 -0.0034795 -0.0559947 -0.0035019 -0.0185248 0.046547 -0.0117141 -0.0084012 -0.0098108 0.0305383 0.0177084 -0.1532024 0.0430595 0.0378372 -0.0244165 0.0297599 0.0789311 0.0580537 -0.0137583 -0.0038541 -0.1141052 0.0497214 -0.0513474 0.0059628 -0.0863157 -0.0329118 0.0159787 0.0021124 0.0137356 0.1005757 -0.1616542 0.0230966 -0.0691331 -0.0156967 0.0792466 -0.0222412 -0.0910581 -0.0200581 0.0637834 0.0795419 -0.1004757 0.0409535 -0.0692265 -0.0567145 0.0382105 0.0326006 0.0480461 0.0679022 0.0893762 0.0197576 -0.023877 0.012358 0.0811153 0.0241235 0.0281412 -0.0218327 -0.1161297 0.0019315 0.1124231 0.0221579 0.1292882 -0.0772269 -0.0639839 0.0408779 -0.0816421 0.0692475 0.0619453 -0.0063479 0.0411338 -0.0071826 0.0995805 0.0023072 -0.0175042 0.0354567 -0.1553801 0.0006619 -0.0780808 0.0033223 -0.1411548 -0.0513572 0.0394976 0.0156725 0.0504497 0.0637702 0.0367285 0.0456067 -0.0651138 0.0977859 0.3122349 0.0598206 -0.1160316 0.051582 0.3321861 unknown
polarizability: 75.7650672|1.229142|72.9855881|2.137669|1.4053776|68.3039638 unknown
InChI: InChI=1S/C5H11NO3/c1-3-5(4(2)7)6(8)9/h4-5,7H,3H2,1-2H3
charge 0 multiplicity 1
20 atoms
O  2.043246 1.432548 -0.166468
O  -1.187484 -1.769022 -0.860236
O  -0.868993 -1.323742 1.354055
N  -0.744298 -1.040084 0.102634
C  -0.015072 0.259774 -0.252321
C  1.431825 0.172846 0.302524
C  -0.805777 1.460842 0.307375
C  2.211237 -1.052696 -0.201334
C  -2.208696 1.615788 -0.314012
H  0.014186 0.279637 -1.355152
H  1.381488 0.163103 1.411407
H  -0.878358 1.352263 1.406246
H  -0.187884 2.352839 0.103197
H  3.242553 -1.042783 0.199648
H  1.74303 -1.995323 0.133109
H  2.26567 -1.057187 -1.304473
H  -2.706653 2.516154 0.087254
H  -2.151791 1.722713 -1.412999
H  -2.857265 0.749143 -0.090648
H  3.017636 1.397983 0.004696
