program: Gaussian 09
title: 000178515
version: EM64L-G09RevD.01
frameworkgroup: C1[X(C15H14O3)]
method: RPBEPBE
basis: SDD
operation: Freq
keyword: #pfreq=noraman
keyword: PBEPBE/SDD
title: #p freq=noraman PBEPBE/SDD
converged: YES YES NO NO
title: Mulliken charges:
elementType: O O O C C C C C C C C C C C C C C C H H H H H H H H H H H H H H
charge: -0.187860 -0.200340 -0.155594 0.267895 -0.532560 -0.363830 0.249739 -0.703063 -0.734378 -0.006667 -0.192033 -0.172131 0.273010 0.316339 -0.378937 -0.366507 -0.228888 -0.232609 0.239345 0.264672 0.223758 0.233683 0.216610 0.241991 0.211642 0.217793 0.213361 0.225197 0.291304 0.289395 0.239590 0.240073
chargesum: 0.00000
title: Mulliken charges with hydrogens summed into heavy atoms:
elementType: O O O C C C C C C C C C C C C C C C
charge: -0.187860 -0.200340 -0.155594 0.267895 -0.028543 0.093611 0.249739 -0.032820 -0.078027 -0.006667 -0.192033 -0.172131 0.273010 0.316339 -0.087633 -0.077113 0.010702 0.007464
polarizability: 2.42200661e+02 -4.72222272e+00 1.88332900e+02 7.82106333e+00 1.29458508e+00 9.13263025e+01
1716.lowfreq: -10.2760 -5.6147 -0.0005 -0.0003 -0.0002 9.5314 40.8634 68.5390 81.7986
frequency: 40.8163 68.5193 81.7933 125.4824 159.6792 172.5291 178.7076 201.0434 223.7655 257.9963 271.9858 285.3324 292.1851 354.8547 366.3992 394.2705 408.7068 418.0260 420.9584 444.0434 458.0405 529.7074 549.9193 561.1020 617.6585 656.4394 689.4915 700.0478 728.5108 766.1183 803.4553 845.8671 858.6010 866.0397 895.9565 914.6435 934.3114 939.8281 941.7293 970.7520 985.8172 995.6778 1013.2745 1015.9643 1033.6842 1073.1538 1087.4313 1134.0590 1152.9946 1171.5834 1186.8110 1189.4443 1197.9082 1254.8060 1267.0046 1284.6656 1296.8000 1306.8507 1353.3924 1363.5586 1382.1595 1399.3674 1403.0935 1440.8264 1441.8492 1457.1998 1464.0248 1470.9236 1472.8856 1482.2332 1485.4070 1522.4423 1557.5354 1579.2732 1605.6297 1611.9202 2971.7189 2972.7194 2981.8601 2995.3521 3043.9186 3066.6151 3072.9820 3077.4845 3086.7130 3095.3373 3136.7650 3151.3451 3161.7869 3171.6952
redmass: 4.8431 3.7850 4.7719 4.9376 1.3428 3.7953 2.5044 4.0846 1.1609 2.9609 3.4407 4.0053 3.9311 2.8770 10.4357 2.1745 5.8771 2.8236 2.8141 4.7018 9.4799 5.0836 5.1239 6.6406 6.4488 6.1407 4.1578 6.5354 2.7390 4.1974 1.7287 2.9976 4.3219 4.9642 1.7829 1.7833 1.7868 1.8166 1.7855 4.0740 2.2460 1.3986 1.3620 1.4624 2.0435 3.6001 2.2498 1.4925 2.2320 1.1331 1.5208 2.2689 2.2486 1.7521 2.5051 2.1263 1.8845 3.4972 1.4696 3.6956 1.2126 9.6271 1.2102 2.3719 1.1436 1.0827 1.0470 2.5842 1.0988 1.0604 1.0625 10.3290 10.4040 7.4307 7.1778 7.7720 1.0514 1.0495 1.0371 1.0636 1.0936 1.0995 1.0998 1.0990 1.0992 1.1017 1.0862 1.0901 1.0946 1.1004
irintensity: 4.8213 0.1456 3.0976 0.0463 0.3587 0.4416 1.5991 5.7743 0.3656 0.1691 2.3781 0.4350 1.7706 0.6970 18.3641 0.3408 2.3819 0.0752 1.4982 3.7148 1.7498 5.4165 4.6138 3.3371 1.8488 3.3455 9.9382 0.7220 45.1619 4.8000 35.9757 3.3450 10.6302 6.6741 4.6185 9.8091 0.0301 12.4616 3.8101 106.6932 14.4444 4.0121 0.2443 6.8864 0.8802 47.2362 17.3257 2.2212 27.6226 15.8464 20.6022 159.3526 23.1656 24.3588 16.4122 14.5262 24.6268 178.3069 2.0590 77.2929 23.9193 1.5784 15.7679 1.5204 13.0700 2.6075 0.5064 8.3071 16.5397 10.4701 13.5448 89.4282 207.1829 144.6254 35.1374 50.8757 10.9456 32.5679 25.3218 50.8046 4.3973 31.8194 1.9543 39.7097 33.5292 32.9204 3.9215 5.2136 1.9257 28.0056
temp: 298.150 k
press: 1.00000 atm
elementType: 8 8 8 6 6 6 6 6 6 6 6 6 6 6 6 6 6 6 1 1 1 1 1 1 1 1 1 1 1 1 1 1
symmnumber: 1
zpe: 661075.9 jmol-1
zpe.correction: 0.251791 hartree
zpe.thermalcorrener: 0.267207 hartree
zpe.thermalcorrenthalpy: 0.268151 hartree
zpe.thermalcorrgfe: 0.209715 hartree
zpe.sumelectzpe: -804.384547 hartree
zpe.sumelectthermal: -804.369130 hartree
zpe.sumelectthermalent: -804.368186 hartree
zpe.sumelectthermalfe: -804.426622 hartree
dipole: -1.2102 -1.0161 -0.2244
dipole: 1.5961
quadrupole: -75.2197 -122.5980 -104.7801
quadrupole: -1.0138 2.2286 -0.6121
quadrupole: 25.6462 -21.7321 -3.9141 -1.0138 2.2286 -0.6121
hfenergy: -804.6363371 hartree
pointgroup: C01 [X(C15H14O3)]
dipole: -0.4705784 0.4065231 0.0872222 debye
polarizability: 242.1717967|3.9782185|188.2458644|-9.0588093|0.2077276|91.4422028 unknown
InChI: InChI=1S/C15H14O3/c1-15(2)7-11-12(16)9-5-3-4-6-10(9)13(17)14(11)18-8-15/h3-6H,7-8H2,1-2H3
charge 0 multiplicity 1
32 atoms
O  -1.771662 -1.684138 0.305018
O  0.273484 2.68827 0.109528
O  0.685503 -2.794475 0.042046
C  -3.330935 0.269539 -0.097759
C  -2.174231 1.234897 0.284915
C  -3.087872 -1.064099 0.643029
C  -0.818523 0.561478 0.205789
C  -3.360342 0.031302 -1.629624
C  -4.684984 0.848933 0.376431
C  -0.70118 -0.81877 0.20315
C  0.381655 1.414457 0.113539
C  0.619251 -1.530059 0.072488
C  1.724553 0.75411 0.018973
C  1.83516 -0.664317 -0.01109
C  2.890807 1.549967 -0.055153
C  3.10997 -1.27136 -0.117023
C  4.159893 0.940606 -0.157984
C  4.269737 -0.471838 -0.189991
H  -2.331364 1.628384 1.31045
H  -2.169763 2.124169 -0.371364
H  -3.10288 -0.915052 1.740688
H  -3.820627 -1.838613 0.364946
H  -3.539252 0.982961 -2.162092
H  -2.408702 -0.390756 -1.997626
H  -4.169522 -0.671124 -1.902992
H  -5.526243 0.187907 0.095982
H  -4.706329 0.988546 1.474082
H  -4.862005 1.834835 -0.09103
H  2.776554 2.638291 -0.032616
H  3.165716 -2.36433 -0.139391
H  5.061204 1.560325 -0.214309
H  5.255131 -0.942745 -0.271008
