program: Gaussian 09
title: 000178502
version: EM64L-G09RevD.01
frameworkgroup: C1[X(C15H10O3)]
method: RPBEPBE
basis: SDD
operation: Freq
keyword: #pfreq=noraman
keyword: PBEPBE/SDD
title: #p freq=noraman PBEPBE/SDD
converged: YES YES NO NO
title: Mulliken charges:
elementType: O O O C C C C C C C C C C C C C C C H H H H H H H H H H
charge: -0.386749 -0.442702 -0.357923 0.260423 0.314298 0.160592 0.441148 0.002952 -0.420198 -0.509062 -0.381552 -0.344964 0.082306 -0.440538 -0.401194 -0.256558 -0.250774 0.179877 0.311126 0.235950 0.230633 0.218167 0.244815 0.262030 0.229082 0.231532 0.392696 0.394589
chargesum: 0.00000
title: Mulliken charges with hydrogens summed into heavy atoms:
elementType: O O O C C C C C C C C C C C C C C C
charge: 0.005947 -0.048113 -0.357923 0.260423 0.314298 0.160592 0.441148 0.002952 -0.109072 -0.273113 -0.150919 -0.126797 0.082306 -0.195722 -0.139164 -0.027476 -0.019243 0.179877
polarizability: 3.10793544e+02 -4.48843270e+00 1.94899453e+02 4.54229323e-02 8.22834229e-02 6.55113049e+01
1716.lowfreq: -0.0006 -0.0003 0.0005 6.5859 6.7881 14.2816 47.4528 61.4062 105.4941
frequency: 47.3783 61.3581 105.4938 141.3364 186.8372 203.8737 237.8242 267.2511 332.6857 333.8659 369.2721 405.7458 423.4665 441.7956 450.2318 497.9221 534.0204 539.1804 541.4495 562.3233 589.8393 604.9863 638.8073 664.3304 682.5060 709.0824 747.5463 762.9199 778.8486 804.1673 843.0712 843.8865 855.8158 861.5502 892.6898 917.8443 957.9825 978.4606 985.4168 991.1327 1008.6858 1017.0691 1042.7836 1080.0074 1137.6793 1163.2505 1175.5646 1183.5169 1239.7021 1247.7210 1254.8281 1272.7457 1282.1159 1322.4891 1357.0151 1380.5318 1409.0091 1418.9519 1433.8130 1445.1232 1455.0915 1496.8848 1525.3658 1564.9858 1597.2377 1606.3306 1622.7946 1630.7582 2829.3213 3123.6156 3127.6016 3134.4030 3150.9162 3159.8904 3168.1968 3183.8163 3215.1404 3500.2371
redmass: 5.3168 6.9489 4.8646 6.2927 6.2641 5.1792 4.1686 6.5476 4.7344 7.8427 7.3403 3.4901 5.9910 7.2921 3.1667 6.3928 2.5658 3.2976 5.3568 6.1009 7.6399 1.3647 3.5067 4.7777 6.0047 4.9836 2.5670 1.5147 6.3884 2.1982 6.4622 1.4703 1.9637 4.7034 1.9181 1.0706 1.4011 1.3820 4.7320 1.3319 1.3706 6.6038 2.2850 2.6366 1.5743 1.4085 1.2667 1.2222 2.1518 1.6281 1.6732 1.9980 3.0624 2.5097 4.5368 4.6682 4.1823 3.0286 2.8989 2.7150 2.2523 3.6189 3.5407 7.0321 3.8045 4.8426 5.2092 6.0704 1.0705 1.0870 1.0903 1.0887 1.0932 1.0904 1.0967 1.0969 1.0926 1.0634
irintensity: 0.2733 0.0531 0.2614 0.1560 0.0386 1.2194 6.8375 0.3351 0.4037 4.1328 6.4966 4.5704 7.0647 0.9998 1.9152 3.1285 17.8867 3.0975 28.0969 14.2489 11.1584 104.8413 14.6689 37.1465 0.8663 27.4320 1.7511 65.3702 2.9670 9.1659 2.1022 77.4296 17.8853 2.9822 22.2282 135.2994 4.9110 0.9130 37.6913 0.1372 0.2308 40.8106 40.5335 138.6127 69.2882 101.6949 20.6471 12.6598 6.4765 205.5763 41.4294 9.4272 87.1136 1.2560 47.6451 21.4492 6.2147 56.6291 92.5092 110.2761 100.7756 6.5333 14.8425 82.8291 50.8060 33.8601 167.2152 138.1926 340.6768 0.5022 12.9557 10.8160 19.7609 13.2269 29.0565 11.0382 12.2122 67.9043
temp: 298.150 k
press: 1.00000 atm
elementType: 8 8 8 6 6 6 6 6 6 6 6 6 6 6 6 6 6 6 1 1 1 1 1 1 1 1 1 1
symmnumber: 1
zpe: 548843.0 jmol-1
zpe.correction: 0.209043 hartree
zpe.thermalcorrener: 0.222288 hartree
zpe.thermalcorrenthalpy: 0.223232 hartree
zpe.thermalcorrgfe: 0.169096 hartree
zpe.sumelectzpe: -802.088682 hartree
zpe.sumelectthermal: -802.075438 hartree
zpe.sumelectthermalent: -802.074494 hartree
zpe.sumelectthermalfe: -802.128630 hartree
dipole: 2.3400 -1.4109 0.0039
dipole: 2.7325
quadrupole: -99.6633 -88.4848 -108.9753
quadrupole: 10.0217 -0.0295 0.0199
quadrupole: -0.6222 10.5563 -9.9342 10.0217 -0.0295 0.0199
hfenergy: -802.2977257 hartree
pointgroup: C01 [X(C15H10O3)]
dipole: -0.919397 0.5559525 0.0365207 debye
polarizability: 310.7649639|-4.8339774|194.2529474|1.073349|9.2659801|66.1863898 unknown
InChI: InChI=1S/C15H10O3/c16-13-8-7-11-10-4-2-1-3-9(10)5-6-12(11)14(13)15(17)18/h1-8,16-17H
charge 0 multiplicity 1
28 atoms
O  3.75797 -1.765569 -0.065264
O  2.892512 2.345441 0.243533
O  4.404117 0.638126 0.116093
C  -0.342394 -0.695406 -0.007088
C  0.633457 0.365024 0.074534
C  -1.774865 -0.39259 0.00664
C  -2.200725 0.981524 0.100191
C  2.054568 0.033549 0.059398
C  0.152345 1.725695 0.16746
C  -1.201986 2.013131 0.178456
C  0.11831 -2.049146 -0.10332
C  -2.791359 -1.39813 -0.06832
C  2.451807 -1.348498 -0.040229
C  -3.593897 1.30415 0.114646
C  1.467841 -2.373771 -0.120439
C  -4.151464 -1.062984 -0.052833
C  -4.562482 0.299124 0.039116
C  3.164402 0.986354 0.138049
H  0.876744 2.535689 0.229482
H  -1.534205 3.055982 0.249132
H  -0.605975 -2.865353 -0.167386
H  -2.520481 -2.45558 -0.139379
H  -3.889876 2.357416 0.186811
H  1.816534 -3.406872 -0.195418
H  -4.906056 -1.855079 -0.111575
H  -5.62839 0.550355 0.050547
H  4.357122 -0.926581 -0.002084
H  3.765526 2.823898 0.285647
