program: Gaussian 09
title: 000178511
version: EM64L-G09RevD.01
frameworkgroup: C1[X(C13H25NO3)]
method: RPBEPBE
basis: SDD
operation: Freq
keyword: #p
keyword: freq=noraman
keyword: PBEPBE/SDD
title: #p freq=noraman PBEPBE/SDD
converged: NO YES NO NO
title: Mulliken charges:
elementType: O O O N C C C C C C C C C C C C C H H H H H H H H H H H H H H H H H H H H H H H H H
charge: -0.449006 -0.201848 -0.223987 0.115898 -0.006225 -0.190080 -0.448535 -0.454203 -0.407528 -0.406794 -0.104977 -0.385141 -0.472352 -0.373843 -0.350669 -0.359650 -0.695725 0.229183 0.241020 0.228939 0.196757 0.190145 0.225386 0.198339 0.195405 0.193885 0.198235 0.278309 0.199426 0.191471 0.233576 0.223754 0.200937 0.217886 0.352741 0.187913 0.193263 0.201630 0.197193 0.210799 0.209417 0.219054
chargesum: 0.00000
title: Mulliken charges with hydrogens summed into heavy atoms:
elementType: O O O N C C C C C C C C C C C C C
charge: -0.096264 -0.201848 -0.223987 0.115898 0.222959 0.050940 -0.022839 -0.038673 -0.013784 -0.014674 0.173332 0.005756 -0.015022 0.044980 0.030507 0.039173 -0.056454
polarizability: 1.87393662e+02 7.16903695e-01 1.41091683e+02 3.74104352e+00 4.38989428e+00 1.42446286e+02
1716.lowfreq: -20.3490 -12.1704 -5.0868 -0.0008 -0.0005 0.0003 12.8480 31.7317 39.5997
frequency: -8.4515 30.8913 39.5889 43.5799 54.4036 63.3899 90.3829 113.7358 128.5375 145.5128 159.3393 186.8776 202.0288 214.6254 233.3321 259.2418 277.2335 291.4381 307.1717 341.5121 368.0227 393.3155 424.5581 443.5492 486.9832 492.0568 517.6060 632.0765 664.0984 678.0648 728.9636 758.4430 773.7466 784.3532 801.7907 842.2023 862.6090 865.5556 887.5285 893.5120 910.7103 939.8609 959.3074 963.8215 1001.0387 1010.4116 1039.4922 1050.5411 1054.4401 1065.7608 1074.1563 1078.6136 1087.2326 1113.0289 1115.2378 1129.2960 1136.8505 1170.2271 1189.0200 1199.8461 1217.0274 1234.1463 1245.2012 1248.6699 1256.0602 1260.1081 1269.7257 1283.6030 1292.9475 1294.5626 1299.5005 1311.5477 1319.7489 1325.8443 1334.1427 1336.0964 1341.7224 1345.4439 1349.9672 1359.0482 1365.8404 1381.2278 1391.0413 1417.6058 1453.7579 1461.1953 1461.8813 1463.2420 1464.3593 1468.6567 1469.3592 1477.4300 1478.2055 1478.6987 1487.5219 2950.5124 2953.5462 2961.8520 2963.9693 2965.7571 2966.3163 2967.6025 2971.5907 2971.9887 2973.3271 2981.8489 2982.1528 2994.4316 3017.0444 3023.0528 3028.0354 3032.2886 3032.4541 3039.8213 3050.0321 3052.5667 3069.9494 3073.5302 3077.6927 3580.1867
redmass: 4.4196 3.3367 5.8971 5.0009 1.9164 3.6195 3.4138 3.0619 1.8704 3.0217 4.7126 3.9087 2.4268 2.1836 1.1160 3.5104 3.7291 1.3435 2.3179 2.3031 3.0847 3.8216 3.0416 3.2588 3.3590 1.6188 3.7588 3.9743 2.7434 6.4071 1.0814 1.3957 2.3933 1.5061 2.5010 2.2919 1.8321 1.5403 1.9243 1.6192 1.8028 2.4670 2.2929 1.6618 2.6956 2.9608 3.2558 1.3532 1.5893 1.7595 1.7145 2.1430 2.7024 2.2805 2.2004 1.9577 1.7937 1.4498 1.7511 1.5021 1.4069 1.7658 1.4565 1.4471 1.3660 1.4898 1.2770 1.2155 1.1684 1.1426 1.1987 1.2721 1.3204 1.4361 1.3596 1.3597 1.4615 1.4986 1.5131 1.5925 1.5885 1.3566 1.2165 3.6730 1.1000 1.0865 1.0891 1.0779 1.0923 1.0758 1.0836 1.0948 1.0733 1.0422 1.0861 1.0820 1.0588 1.0729 1.0720 1.0618 1.0597 1.0630 1.0582 1.0627 1.0380 1.0606 1.0597 1.0978 1.1010 1.0985 1.0944 1.1026 1.1029 1.1027 1.1018 1.1020 1.1008 1.0992 1.0880 1.0666
irintensity: 0.5999 0.8283 0.0935 0.0464 0.3653 0.7896 0.1967 1.9788 0.0113 2.7026 5.7115 0.2841 0.9874 1.7752 0.2055 23.2189 3.1194 122.5479 29.9187 1.4143 1.5207 5.4935 0.2217 0.3236 3.1354 1.0821 8.8917 1.4889 14.2858 7.2778 13.7280 7.7244 0.5290 0.2818 14.4694 6.6129 6.8496 1.4236 1.9545 14.0638 0.5398 2.5433 44.3524 9.3617 25.9183 2.7124 23.9338 0.7497 0.8371 7.2714 16.6193 10.4660 11.7082 0.9486 13.6454 7.5909 3.8697 19.6666 21.2905 3.0489 8.3296 29.3236 24.6146 3.9720 2.1940 10.0429 0.5784 5.2747 0.7162 0.5293 0.6213 9.9451 4.7574 3.5823 10.8337 1.8170 2.8996 0.8199 1.7247 2.7524 4.9436 4.2478 11.1345 98.6015 1.2512 0.6950 6.6333 3.5824 8.4510 1.3361 20.8354 1.8320 4.9675 12.8455 19.6448 7.4602 9.0858 23.2214 19.1053 33.1754 0.7549 35.8646 72.2704 49.5188 27.8226 25.4958 49.3590 2.1878 0.9992 73.6245 57.6362 17.8833 24.1892 20.5840 91.3787 42.7025 85.9075 50.5281 17.4415 14.6420
temp: 298.150 k
press: 1.00000 atm
elementType: 8 8 8 7 6 6 6 6 6 6 6 6 6 6 6 6 6 1 1 1 1 1 1 1 1 1 1 1 1 1 1 1 1 1 1 1 1 1 1 1 1 1
symmnumber: 1
zpe: 963576.7 jmol-1
zpe.correction: 0.367007 hartree
zpe.thermalcorrener: 0.385747 hartree
zpe.thermalcorrenthalpy: 0.386691 hartree
zpe.thermalcorrgfe: 0.318780 hartree
zpe.sumelectzpe: -789.335521 hartree
zpe.sumelectthermal: -789.316781 hartree
zpe.sumelectthermalent: -789.315837 hartree
zpe.sumelectthermalfe: -789.383749 hartree
dipole: -0.8479 -3.2741 -0.4407
dipole: 3.4107
quadrupole: -99.5920 -115.9947 -105.6800
quadrupole: 3.9172 -0.9275 3.3422
quadrupole: 7.4969 -8.9058 1.4089 3.9172 -0.9275 3.3422
hfenergy: -789.7025282 hartree
pointgroup: C01 [X(C13H25N1O3)]
dipole: -0.3300627 1.2335638 -0.4122783 debye
polarizability: 187.3419571|-2.4718142|144.8589728|-3.2586631|3.2370663|138.730701 unknown
InChI: InChI=1S/C13H25NO3/c1-2-3-5-10-12(14(16)17)13(15)11-8-6-4-7-9-11/h11-13,15H,2-10H2,1H3
charge 0 multiplicity 1
42 atoms
O  0.776237 2.027878 -0.239139
O  -0.234863 -2.496219 0.48321
O  -0.66677 -1.12785 2.257519
N  -0.449039 -1.338094 1.003178
C  2.177721 0.088678 0.226519
C  0.811927 0.75752 0.501888
C  2.47391 -0.098392 -1.285345
C  3.31225 0.898764 0.908546
C  3.862121 -0.745302 -1.510069
C  4.698216 0.252309 0.679478
C  -0.421961 -0.117056 0.082653
C  4.987429 0.068105 -0.828607
C  -1.762442 0.636327 0.185747
C  -2.998697 -0.225092 -0.156564
C  -4.304628 0.601052 -0.152393
C  -5.55639 -0.243121 -0.48298
C  -6.85715 0.588482 -0.485256
H  2.152092 -0.918246 0.698428
H  0.713893 0.944274 1.594231
H  2.43485 0.891145 -1.779692
H  1.698975 -0.731193 -1.760084
H  3.110015 0.980476 1.996059
H  3.306925 1.926903 0.496886
H  4.059236 -0.836717 -2.595868
H  3.857002 -1.775885 -1.098132
H  4.729781 -0.737743 1.180281
H  5.4852 0.873382 1.149685
H  -0.28504 -0.532615 -0.929247
H  5.964054 -0.433003 -0.974268
H  5.060256 1.065146 -1.31043
H  -1.868789 1.054453 1.206527
H  -1.705126 1.481187 -0.527137
H  -2.861822 -0.691933 -1.153647
H  -3.093969 -1.054968 0.571576
H  0.155574 2.653516 0.210597
H  -4.219668 1.431455 -0.884569
H  -4.437403 1.073983 0.843096
H  -5.643995 -1.067664 0.253167
H  -5.421215 -0.723758 -1.473321
H  -7.029507 1.058163 0.501604
H  -6.810087 1.3976 -1.238418
H  -7.737001 -0.038648 -0.71831
