program: Gaussian 09
title: 000178486
version: EM64L-G09RevD.01
frameworkgroup: C1[X(C13H14N4O2S)]
method: RPBEPBE
basis: SDD
operation: Freq
keyword: #p
keyword: freq=noraman
keyword: PBEPBE/SDD
title: #p freq=noraman PBEPBE/SDD
converged: NO NO NO NO
title: Mulliken charges:
elementType: S O O N N N N C C C C C C C C C C C C C H H H H H H H H H H H H H H
charge: 0.882918 -0.549466 -0.549902 -0.156061 0.032761 0.019797 0.033118 0.339589 -0.156012 -0.058867 -0.072767 -0.608104 0.529568 -0.141342 -0.633506 -0.809178 -0.707747 0.235830 -0.425620 -0.783369 0.248585 0.282537 0.232266 0.281654 0.248674 0.214062 0.248723 0.288272 0.271686 0.288165 0.249210 0.260199 0.232166 0.232161
chargesum: 0.00000
title: Mulliken charges with hydrogens summed into heavy atoms:
elementType: S O O N N N N C C C C C C C C C C C C C
charge: 0.882918 -0.549466 -0.549902 -0.156061 0.032761 0.019797 0.033118 0.339589 -0.156012 -0.058867 -0.072767 -0.359519 0.529568 -0.141342 0.162952 -0.097719 0.140376 0.235830 -0.176410 -0.058843
polarizability: 3.17571323e+02 -1.45096600e+01 2.28450050e+02 -5.74257713e-02 7.07756996e-02 1.12692940e+02
1716.lowfreq: -105.0692 -24.4584 -6.1185 -3.5134 -0.0004 0.0009 0.0027 2.7202 17.3757
frequency: -104.9393 -24.3763 16.8585 48.1149 75.6552 85.9522 89.3188 105.6339 121.5367 135.6569 161.4856 187.0654 189.6300 215.8300 231.0131 238.6861 268.6677 271.0411 306.4583 330.8284 333.7155 362.5227 384.1482 390.1453 454.8387 455.3531 475.1903 503.8766 574.6304 574.8764 623.0612 630.1303 637.6817 639.1405 685.3570 711.1350 743.2179 793.3208 797.9739 843.3517 867.5256 886.1444 891.4813 908.5892 966.1109 983.0964 988.1039 1014.7832 1024.0543 1040.0475 1046.3820 1051.1360 1074.8875 1111.6903 1128.4944 1196.1787 1229.4495 1252.4410 1268.2535 1288.8549 1300.8366 1304.1820 1355.9962 1377.4939 1390.7758 1391.1633 1402.6742 1405.7664 1407.3788 1415.0419 1438.7461 1452.1278 1456.9309 1464.9745 1465.2136 1466.6477 1470.1321 1488.9009 1501.8830 1533.0439 1566.8953 1616.3250 2986.0580 2993.8181 3009.8429 3041.7280 3063.5791 3076.0655 3098.3635 3100.9446 3122.7814 3126.0764 3136.9783 3147.2651 3193.2080 3201.7569
redmass: 1.0234 1.0349 5.3402 6.0735 3.7082 4.8406 3.7167 1.1011 1.3773 2.3769 6.0532 3.6031 4.2144 4.6892 4.0425 2.8411 6.4251 4.2568 3.6441 5.0464 5.7551 5.9725 6.6787 6.6260 5.8745 6.4838 6.2875 5.2451 4.8696 7.6428 3.4831 6.6385 7.8132 6.2141 6.6969 4.7165 5.7530 8.2047 10.9554 7.3363 1.4649 3.6917 5.1330 1.3338 1.7720 1.4824 2.1431 1.7061 2.2645 5.1426 1.6040 1.5817 2.0507 4.3361 1.3098 2.2600 5.7089 2.8572 2.6258 6.3550 2.8283 1.3857 4.6558 3.0650 1.9667 1.7036 1.2781 1.1927 1.0532 3.6820 1.7562 1.0453 1.5313 1.4609 1.0461 1.0356 1.8197 1.2088 2.0170 5.6831 8.8774 7.3236 1.0383 1.0363 1.0341 1.0241 1.0970 1.0964 1.1010 1.1032 1.0980 1.0924 1.1011 1.0920 1.1085 1.1078
irintensity: 0.1254 0.6433 6.7297 0.0151 6.3339 5.3337 0.1450 0.0023 2.6782 1.2608 15.4038 0.0361 2.1836 0.0089 1.2621 0.7032 0.2544 0.1116 7.1472 4.9696 17.2804 25.1307 6.7527 62.0254 2.5425 1.4373 8.5010 6.7972 6.7402 52.3637 0.0718 14.3268 1.1718 12.5064 11.8976 5.6217 0.0133 31.7133 47.1684 0.2244 14.1878 44.7864 5.9957 13.5415 20.0896 20.0153 79.8797 54.1502 2.5782 2.5707 4.9290 11.9988 0.8089 21.5054 1.3401 8.6080 12.9525 10.8613 31.2050 14.6663 1.2234 14.3407 2.8491 18.2613 5.3167 23.6030 18.5600 0.6584 13.0992 64.6269 9.5702 12.2458 7.5905 13.8575 16.1908 22.8454 25.9009 33.8951 23.9014 74.8116 4.7060 42.1872 16.0811 22.9561 18.4815 0.2301 15.2864 10.4120 19.6212 3.2073 5.5779 25.7432 6.1073 11.3268 1.1431 0.0014
temp: 298.150 k
press: 1.00000 atm
elementType: 16 8 8 7 7 7 7 6 6 6 6 6 6 6 6 6 6 6 6 6 1 1 1 1 1 1 1 1 1 1 1 1 1 1
symmnumber: 1
zpe: 663224.0 jmol-1
zpe.correction: 0.252609 hartree
zpe.thermalcorrener: 0.271241 hartree
zpe.thermalcorrenthalpy: 0.272186 hartree
zpe.thermalcorrgfe: 0.204860 hartree
zpe.sumelectzpe: -1269.689573 hartree
zpe.sumelectthermal: -1269.670941 hartree
zpe.sumelectthermalent: -1269.669996 hartree
zpe.sumelectthermalfe: -1269.737322 hartree
dipole: 4.0628 0.5101 0.0081
dipole: 4.0947
quadrupole: -137.6750 -101.3991 -132.9857
quadrupole: -1.3826 -0.0335 -0.0514
quadrupole: -13.6550 22.6208 -8.9658 -1.3826 -0.0335 -0.0514
hfenergy: -1269.942182 hartree
pointgroup: C01 [X(C13H14N4O2S1)]
dipole: 1.5954925 -0.2227171 -0.0031861 debye
polarizability: 317.9545765|13.2750619|228.066796|0.0583965|0.0699769|112.6929396 unknown
InChI: InChI=1S/C13H14N4O2S/c1-7-5-9-11(12-10(7)14-6-8(2)15-12)16-13(17(9)3)20(4,18)19/h5-6H,1-4H3
charge 0 multiplicity 1
34 atoms
S  -3.977126 0.717554 -0.001359
O  -4.651412 0.228346 -1.407903
O  -4.654804 0.235434 1.406082
N  -1.850707 -1.197778 0.003681
N  -1.145537 0.992342 0.002172
N  1.817309 1.749013 0.001192
N  3.659725 -0.449222 -0.000414
C  -0.446401 -1.229877 0.001643
C  -0.028156 0.136591 0.001091
C  -2.180273 0.153878 0.001894
C  1.370683 0.441691 0.00052
C  0.460211 -2.325422 0.000652
C  1.831767 -2.061691 -0.000349
C  2.291777 -0.681308 -0.000129
C  -2.798693 -2.327278 0.002527
C  2.851656 -3.177648 -0.001722
C  -3.762977 2.6194 -0.005426
C  3.156955 1.948568 0.001116
C  4.067517 0.83324 0.000201
C  3.665865 3.370051 0.002078
H  0.103258 -3.360188 0.00001
H  -3.464211 -2.258698 0.879439
H  -2.236884 -3.271181 0.044038
H  -3.412281 -2.304047 -0.91364
H  3.512367 -3.105934 -0.883591
H  2.362663 -4.166042 -0.001508
H  3.514294 -3.106436 0.878731
H  -3.206646 2.872377 0.905669
H  -4.793149 3.001118 -0.006786
H  -3.205579 2.86851 -0.916906
H  5.149676 1.00769 0.00009
H  2.813286 4.06544 0.002947
H  4.290859 3.57213 -0.887693
H  4.291469 3.570676 0.891752
