program: Gaussian 09
title: 000178548
version: EM64L-G09RevD.01
frameworkgroup: C1[X(C22H19Br2NO3)]
method: RPBEPBE
basis: SDD
operation: Freq
keyword: #p
keyword: freq=noraman
keyword: PBEPBE/SDD
title: #p freq=noraman PBEPBE/SDD
converged: YES YES NO NO
title: Mulliken charges:
elementType: Br Br O O O N C C C C C C C C C C C C C C C C C C C C C C H H H H H H H H H H H H H H H H H H H
charge: 0.090783 0.064355 -0.268503 -0.283979 -0.301681 0.009238 0.307437 -0.280570 -0.388310 -0.735121 -0.720817 0.165370 0.323599 -0.629930 -0.197043 0.497395 -0.193947 -0.400998 -0.349210 -0.360082 -0.378565 0.329075 0.345548 -0.362881 -0.380237 -0.202243 -0.192674 -0.246326 0.258963 0.276945 0.223579 0.253293 0.216193 0.218578 0.228246 0.225096 0.283597 0.283686 0.262384 0.253796 0.271407 0.262057 0.264805 0.259962 0.231048 0.233310 0.233371
chargesum: 0.00000
title: Mulliken charges with hydrogens summed into heavy atoms:
elementType: Br Br O O O N C C C C C C C C C C C C C C C C C C C C C C
charge: 0.090783 0.064355 -0.268503 -0.283979 -0.301681 0.009238 0.307437 -0.021607 -0.111365 -0.042056 -0.048897 0.448967 0.323599 -0.629930 0.086643 0.497395 -0.193947 -0.138614 -0.095414 -0.088675 -0.116508 0.329075 0.345548 -0.098076 -0.120275 0.028806 0.040636 -0.012955
polarizability: 3.94014124e+02 2.79707016e+01 2.86938916e+02 5.02457860e+00 1.26477119e+01 2.24069019e+02
1716.lowfreq: -5.1753 -3.5742 -0.1337 -0.0004 -0.0002 0.0001 6.8741 8.0442 15.3988
frequency: 6.2656 7.7291 15.3414 20.2339 25.1560 31.1226 51.9061 63.9097 71.5276 80.0561 86.5537 96.3103 117.7800 128.5637 148.9902 165.4845 176.4649 178.4949 202.4846 214.4281 215.9781 243.1899 253.7386 266.8308 298.9656 318.0722 327.0012 353.0965 364.6262 382.7007 408.9664 411.4450 414.6206 427.1941 434.1408 440.9427 481.6443 483.9064 523.1272 539.3277 568.6504 580.7813 602.5734 617.0578 631.4841 638.6747 692.2493 701.7708 714.6208 722.3339 738.8666 740.7338 770.5361 787.7976 825.9371 831.5189 832.7421 840.6808 855.0108 860.5789 863.8819 877.0728 911.0387 944.0958 960.7471 961.5744 968.2827 968.7337 976.4440 987.4515 990.3062 992.9511 995.5402 1007.4123 1019.3513 1040.2051 1055.0636 1076.3555 1109.8715 1120.2666 1125.3715 1152.7149 1167.5933 1170.8398 1175.3744 1189.7186 1200.6081 1215.6856 1228.5453 1264.6620 1276.0521 1279.9711 1305.2140 1313.3494 1320.4564 1353.4750 1381.4108 1388.9597 1393.3463 1394.7085 1408.6016 1424.6313 1441.8106 1463.1043 1465.8422 1470.6208 1481.8513 1491.3899 1494.8063 1585.5120 1595.8865 1603.1351 1611.9381 1620.1777 1621.4120 2206.0134 2974.7310 2987.0547 3021.8464 3067.9317 3072.2641 3076.2030 3107.9130 3119.9898 3131.9606 3133.0519 3141.4980 3142.3377 3144.0026 3154.8272 3156.6289 3165.5789 3169.8509 3174.0183 3176.2190
redmass: 8.2810 8.2773 7.3161 5.1173 5.1963 13.0502 5.0105 4.4811 7.7566 4.1260 7.9760 9.0025 10.6886 5.4229 1.9944 2.6067 3.1276 2.6006 2.8494 2.0310 5.3487 7.5830 3.9290 6.5847 5.0013 6.7104 5.0975 3.7826 5.0378 4.2410 2.9078 4.9727 3.1016 4.8209 5.6263 4.3004 3.0148 3.6826 3.7641 5.0573 5.1549 6.8393 5.5892 6.3810 4.3254 6.6826 2.2881 5.9607 6.7106 4.7224 4.1935 4.5347 1.9726 4.4080 2.8317 2.2541 1.6544 1.2807 5.1261 3.5708 2.3381 1.6514 1.4207 2.7002 1.3200 1.3756 1.5764 1.3986 1.3553 6.0466 1.3148 2.1365 2.2185 2.7346 2.1036 2.1534 1.4970 1.5049 1.9477 1.3271 1.7624 2.1500 2.9597 1.0938 1.2208 1.4278 2.0231 1.5602 3.8678 1.3563 1.2789 1.6033 1.3745 2.3442 1.4421 1.5938 7.1282 1.3694 4.5978 1.9250 1.3438 3.0796 2.2790 1.0534 1.0493 2.2566 1.1008 1.0584 2.5407 7.0321 6.3302 6.5849 9.4943 6.9085 7.9397 12.5938 1.0356 1.0376 1.0829 1.0997 1.0988 1.0998 1.0980 1.0894 1.0879 1.0852 1.0901 1.0890 1.0896 1.0899 1.0934 1.0967 1.0951 1.0961 1.1005
irintensity: 0.0092 0.1853 0.1752 0.0439 1.1137 0.1619 0.4965 0.5470 2.5135 0.3970 4.0029 1.9113 0.3842 0.9084 0.7254 0.9596 0.4948 0.3367 0.8342 0.7557 4.4708 8.4003 1.1258 7.8813 15.7470 3.5326 1.9679 12.8813 3.2453 7.2373 0.8127 3.9520 1.1786 9.8885 1.2088 4.6413 2.9447 16.3596 23.2745 14.4077 14.1544 5.0714 4.4173 2.8281 3.7605 8.2613 27.8179 22.2198 121.6420 4.3039 9.3894 67.6928 55.7923 182.5825 29.7856 44.9641 24.5874 2.6120 29.7991 77.4862 45.7279 21.7251 5.2393 19.6262 3.0004 0.3764 12.5117 1.2284 1.2745 4.2584 0.6154 140.4146 31.3847 21.9482 13.5936 99.0396 221.8038 12.2723 235.2615 8.5452 52.3333 4.6762 58.5029 2.1957 56.5281 87.5956 0.2375 41.2890 493.0790 30.8093 9.2023 20.6426 3.1041 3.1835 4.5494 78.7183 3.9052 56.8735 4.7021 93.5325 27.8657 2.9415 3.3535 3.6658 7.7933 176.3219 12.1574 15.4235 126.4626 2.0438 55.1311 109.2995 92.7653 17.8997 72.2322 2.2293 28.5030 31.1019 18.7545 0.0553 50.7531 27.3466 8.1760 10.5108 39.6221 2.1499 3.1199 7.8615 6.8843 2.1752 27.8636 13.2231 2.9920 2.1587 8.9902
temp: 298.150 k
press: 1.00000 atm
elementType: 35 35 8 8 8 7 6 6 6 6 6 6 6 6 6 6 6 6 6 6 6 6 6 6 6 6 6 6 1 1 1 1 1 1 1 1 1 1 1 1 1 1 1 1 1 1 1
symmnumber: 1
zpe: 916711.9 jmol-1
zpe.correction: 0.349157 hartree
zpe.thermalcorrener: 0.377154 hartree
zpe.thermalcorrenthalpy: 0.378098 hartree
zpe.thermalcorrgfe: 0.282456 hartree
zpe.sumelectzpe: -1155.009753 hartree
zpe.sumelectthermal: -1154.981756 hartree
zpe.sumelectthermalent: -1154.980811 hartree
zpe.sumelectthermalfe: -1155.076454 hartree
dipole: -3.1986 -4.9628 2.4788
dipole: 6.4035
quadrupole: -178.3972 -198.1154 -174.4091
quadrupole: 12.9651 12.0851 3.0333
quadrupole: 5.2433 -14.4748 9.2315 12.9651 12.0851 3.0333
hfenergy: -1155.3589098 hartree
pointgroup: C01 [X(C22H19Br2N1O3)]
dipole: 1.2220356 -1.9768445 0.9725085 debye
polarizability: 395.0683225|-22.1575658|234.2625617|16.5336504|-24.8087606|275.6911743 unknown
InChI: InChI=1S/C22H19Br2NO3/c1-22(2)17(12-19(23)24)20(22)21(26)28-18(13-25)14-8-10-16(11-9-14)27-15-6-4-3-5-7-15/h3-12,17-18,20H,1-2H3
charge 0 multiplicity 1
47 atoms
Br -6.798479 1.575906 2.99481
Br -8.006829 -0.330137 0.616202
O  -1.808907 0.966038 -1.57206
O  -2.283356 1.023263 0.718093
O  4.47577 -0.020476 -0.532793
N  -1.026167 3.667706 -3.47623
C  -3.617346 -1.826676 0.124408
C  -4.75619 -0.794071 0.001794
C  -3.413348 -0.572436 -0.783412
C  -2.844183 -1.972927 1.432229
C  -3.813095 -3.141984 -0.63079
C  -5.142076 0.097387 1.120691
C  -2.485748 0.521658 -0.419211
C  -6.412374 0.385621 1.495363
C  -0.80755 2.089965 -1.340756
C  0.587366 1.534695 -1.125577
C  -0.932801 2.952704 -2.527132
C  1.049778 1.330758 0.198197
C  1.431294 1.196798 -2.214404
C  2.329146 0.792485 0.442391
C  2.708689 0.656145 -1.985523
C  3.153986 0.453142 -0.657622
C  4.935513 -0.632573 0.667336
C  4.20891 -1.658775 1.31372
C  6.21438 -0.243088 1.116983
C  4.777436 -2.289491 2.44273
C  6.772324 -0.886602 2.24408
C  6.05589 -1.906585 2.913073
H  -5.584388 -1.095764 -0.648898
H  -3.463799 -0.748456 -1.861059
H  -3.438515 -2.567302 2.150544
H  -2.600829 -1.005876 1.89925
H  -1.894231 -2.508711 1.250654
H  -4.393304 -3.003092 -1.560982
H  -4.356733 -3.867945 0.002143
H  -2.836944 -3.586607 -0.899864
H  -4.330763 0.571728 1.687239
H  -1.146148 2.635938 -0.439079
H  0.401304 1.589132 1.042688
H  1.090261 1.362133 -3.24251
H  2.684249 0.655989 1.467626
H  3.376841 0.395885 -2.811211
H  3.229281 -1.966434 0.934186
H  6.750466 0.545757 0.581127
H  4.223024 -3.087988 2.947902
H  7.765156 -0.589351 2.598503
H  6.490838 -2.402385 3.78715
