program: Gaussian 09
title: 000178475
version: EM64L-G09RevD.01
frameworkgroup: C1[X(C11H9BrN4)]
method: RPBEPBE
basis: SDD
operation: Freq
keyword: #p
keyword: freq=noraman
keyword: PBEPBE/SDD
title: #p freq=noraman PBEPBE/SDD
converged: NO NO NO NO
title: Mulliken charges:
elementType: Br N N N N C C C C C C C C C C C H H H H H H H H H
charge: 0.056311 -0.143954 0.052337 0.048379 -0.026141 0.314605 -0.066271 0.017122 0.004707 -0.347916 -0.340015 -0.189377 -0.637241 0.223990 -0.415714 -0.783330 0.235709 0.262662 0.264260 0.239708 0.264284 0.248785 0.231684 0.253733 0.231685
chargesum: 0.00000
title: Mulliken charges with hydrogens summed into heavy atoms:
elementType: Br N N N N C C C C C C C C C C C
charge: 0.056311 -0.143954 0.052337 0.048379 -0.026141 0.314605 -0.066271 0.017122 0.004707 -0.112207 -0.077353 -0.189377 0.131011 0.223990 -0.166928 -0.066228
polarizability: 2.93419749e+02 -1.46108456e+01 1.63968149e+02 -1.49889464e-02 2.52096317e-02 6.84151103e+01
1716.lowfreq: -5.3135 -0.0007 -0.0003 0.0007 0.8873 5.6381 16.0243 52.3281 62.3599
frequency: 13.2484 52.3176 62.2335 85.0997 114.3465 122.5593 178.9111 212.3071 243.5356 261.2303 279.8983 289.1924 365.9168 372.7086 434.9863 448.5513 508.8874 531.6025 558.0116 599.2936 601.3237 639.2985 647.6324 693.5411 720.8994 721.4968 805.4033 818.6259 836.1764 911.3124 941.9974 960.1014 974.2444 997.7295 1045.1173 1047.7513 1070.1856 1121.8907 1136.3404 1180.1115 1213.8822 1253.1726 1279.6361 1289.5217 1312.9726 1336.7332 1364.1119 1381.4993 1391.9611 1414.8398 1431.4602 1454.8149 1461.7640 1465.6998 1468.4340 1481.3628 1492.0502 1531.5276 1572.3168 1602.8102 2982.4958 3001.8960 3060.4156 3090.2025 3115.2180 3120.7497 3121.5542 3141.7722 3172.1908
redmass: 1.0355 3.3416 1.1790 3.8024 8.0681 5.1728 4.2556 4.1048 7.6832 4.9814 6.0437 3.4046 5.2522 6.0356 5.1582 4.7391 8.3777 5.1050 6.4714 5.3188 3.3850 8.7421 6.2269 7.8667 5.7088 3.9119 2.2962 6.4994 3.4814 1.3509 2.8717 1.3281 4.6915 2.3858 3.6783 1.5918 2.2614 1.3113 1.4342 3.5060 3.3178 2.6794 5.2501 4.8522 2.9233 4.8549 3.6200 4.5920 1.2726 2.9656 3.5971 1.3394 1.4434 1.0459 1.0393 1.4327 2.1254 5.6344 7.3053 8.2756 1.0380 1.0341 1.0972 1.1027 1.0984 1.1003 1.0921 1.0889 1.0964
irintensity: 0.0270 3.0552 0.0199 3.0460 0.8635 2.1616 1.5299 4.4504 1.9502 2.7266 0.9121 0.3667 1.0385 0.7854 2.6322 5.6106 1.6553 1.3519 2.4610 4.3818 0.0933 0.0293 0.6050 0.8089 7.6927 13.7482 28.1239 0.7142 17.1053 9.4560 16.6331 0.9170 9.4404 18.2596 22.6881 7.6544 69.2759 0.8153 15.7817 1.1630 3.2273 42.9898 70.6324 21.2187 12.6638 0.8611 43.2207 209.7829 45.5101 14.4715 12.0327 22.9729 11.9780 15.8481 14.9954 38.0867 63.4541 13.6041 9.3620 29.8420 21.3970 38.5583 17.1379 13.5790 8.3285 9.2094 25.0709 5.8372 9.6523
temp: 298.150 k
press: 1.00000 atm
elementType: 35 7 7 7 7 6 6 6 6 6 6 6 6 6 6 6 1 1 1 1 1 1 1 1 1
symmnumber: 1
zpe: 476192.0 jmol-1
zpe.correction: 0.181372 hartree
zpe.thermalcorrener: 0.195395 hartree
zpe.thermalcorrenthalpy: 0.196339 hartree
zpe.thermalcorrgfe: 0.137597 hartree
zpe.sumelectzpe: -655.918606 hartree
zpe.sumelectthermal: -655.904583 hartree
zpe.sumelectthermalent: -655.903639 hartree
zpe.sumelectthermalfe: -655.962381 hartree
dipole: -0.8880 4.4831 0.0005
dipole: 4.5701
quadrupole: -83.4296 -96.6502 -103.4967
quadrupole: -15.4572 -0.0003 0.0009
quadrupole: 11.0960 -2.1247 -8.9712 -15.4572 -0.0003 0.0009
hfenergy: -656.099978 hartree
pointgroup: C01 [X(C11H9Br1N4)]
dipole: -0.5980711 -1.6956516 -0.0002038 debye
dipolederiv: -0.6933657 0.2861232 -0.0000397 0.2974032 -0.1498807 -0.0001421 0.0000083 -0.0000607 0.020634 -0.9887094 -0.0104928 -0.0003914 -0.0741825 -0.4661819 -0.0004353 0.00139 0.000738 -0.0879202 -1.1997718 0.0937218 -0.0002595 -0.0063023 -0.3539936 0.0000429 -0.0000108 -0.0000433 -0.1902228 -0.1660129 0.0645517 0.0000252 0.0627817 -0.1237651 0.0000243 0.0000196 0.0000303 -0.2366839 -0.318837 0.1119191 0.0000131 -0.0927783 -0.1982901 0.0000059 -0.0000387 0.0000004 -0.2694698 0.7034995 -0.0111166 0.0000357 0.1665929 -0.3654056 0.000005 -0.0003283 -0.0002945 0.041575 0.1134267 -0.1456689 0.0001414 -0.5642622 0.1680549 -0.0002077 -0.0001487 -0.0000201 0.0082179 0.4645404 0.1696063 0.0000219 -0.2525486 -0.1457527 -0.0000323 0.0000006 0.0000094 0.079864 -0.0563207 -0.0976914 -0.0000274 0.6132726 -0.0067892 -0.0000141 0.0000756 -0.0000178 0.1111762 -0.0130943 -0.0980165 0.0000221 -0.0967182 0.2214064 0.0001791 0.0000878 0.0000416 -0.1607901 -0.1812478 0.0938986 0.0000096 -0.061901 0.1127936 0.0000601 0.0000711 0.0001169 -0.1748687 1.5752296 -0.4663709 0.0002208 -0.0871298 0.7619732 0.0001694 -0.0000156 0.0001841 -0.0312535 0.4233091 0.1895649 0.0009314 0.2417803 0.240712 0.0008873 0.0006284 0.0002507 0.2165558 0.8463508 0.0799081 0.000044 -0.3294213 -0.1325435 -0.0000546 -0.0000175 -0.0000272 0.1026695 -0.2947284 -0.0777896 -0.0000438 0.38264 0.3303497 0.0000682 0.0000193 0.0000317 -0.0278362 -0.3598726 -0.0405652 -0.0000206 -0.0932742 0.0291209 -0.0000035 0.0000107 0.0000048 0.0437862 0.0296299 -0.1123034 -0.0000168 -0.0697457 -0.0442998 -0.0000746 -0.0001407 -0.00002 0.1693083 0.0578723 0.0866449 0.0000179 0.0216167 -0.0173779 -0.0000378 0.0000077 -0.000052 0.1627095 -0.0383301 -0.0557893 -0.0665261 -0.0148056 0.0840433 0.0496588 -0.1102339 0.0022238 -0.032937 0.0799473 0.1205098 -0.0011229 0.0124777 -0.0701404 0.0011006 -0.0006427 0.0009379 0.1235284 -0.0389069 -0.0547444 0.0669805 -0.0121897 0.0846342 -0.0511807 0.1092826 -0.0040123 -0.0303689 -0.0082316 -0.0930159 -0.0000159 -0.1260856 -0.0317592 -0.0000235 -0.0000181 -0.0000196 0.1176978 -0.0036234 -0.0202558 -0.0409107 -0.0247487 0.0679286 -0.1022865 -0.1042144 -0.0838128 -0.0365194 0.0708961 0.0076473 -0.0000033 0.132304 -0.0627493 -0.0000026 -0.0000019 -0.0000122 0.1176357 -0.0036491 -0.0202748 0.0409145 -0.0247756 0.0679121 0.1022936 0.1042096 0.0838231 -0.036488 unknown
polarizability: 294.9078829|-4.3151945|162.4800143|0.0184411|0.0228061|68.4151103 unknown
InChI: InChI=1S/C11H9BrN4/c1-6-5-13-9-7(14-6)3-4-8-10(9)15-11(12)16(8)2/h3-5H,1-2H3
charge 0 multiplicity 1
25 atoms
Br -4.522629 1.80508 -0.000099
N  -2.766058 -0.504974 -0.00003
N  -1.641496 1.502687 -0.000111
N  1.424901 1.661759 0.000032
N  2.794022 -0.870489 -0.000322
C  -1.393546 -0.817661 -0.000285
C  -0.715257 0.441896 -0.000193
C  0.71783 0.472476 -0.000157
C  1.407572 -0.809076 -0.000339
C  -0.717771 -2.069218 -0.000559
C  0.676347 -2.048018 -0.000551
C  -2.827989 0.896431 -0.000011
C  -3.894239 -1.443759 -0.000644
C  3.47344 0.30117 -0.000134
C  2.769171 1.55822 0.000041
C  4.98389 0.252944 -0.00007
H  -1.258915 -3.021102 -0.000849
H  1.261213 -2.972287 -0.00076
H  -4.516288 -1.306575 -0.901741
H  -3.503081 -2.472578 0.006442
H  -4.524166 -1.297458 0.893449
H  3.330207 2.500647 0.000168
H  5.402045 0.760131 0.889698
H  5.316883 -0.796473 -0.000118
H  5.402114 0.760226 -0.889754
