program: Gaussian 09
title: 000178462
version: EM64L-G09RevD.01
frameworkgroup: C1[X(C6H6Br2N2O)]
method: RPBEPBE
basis: SDD
operation: Freq
keyword: #p
keyword: freq=noraman
keyword: PBEPBE/SDD
title: #p freq=noraman PBEPBE/SDD
converged: YES YES NO NO
title: Mulliken charges:
elementType: Br Br O N N C C C C C C H H H H H H
charge: 0.098333 0.057714 -0.263138 -0.135772 0.067903 0.391711 -0.168798 -0.651213 -0.395402 0.177229 -0.774636 0.255860 0.315728 0.255760 0.254439 0.254351 0.259932
chargesum: 0.00000
title: Mulliken charges with hydrogens summed into heavy atoms:
elementType: Br Br O N N C C C C C C
charge: 0.098333 0.057714 -0.263138 -0.135772 0.067903 0.391711 -0.168798 0.176135 -0.395402 0.177229 -0.005914
polarizability: 1.67665802e+02 1.30561068e+00 1.28173946e+02 3.20994578e-03 -5.40750558e-03 4.96160319e+01
1716.lowfreq: -6.5469 -4.6350 -0.0001 0.0003 0.0004 4.8724 38.2078 72.4158 112.3995
frequency: 38.1429 72.4054 112.3975 135.1856 135.8784 156.3013 175.8430 240.1368 242.7475 277.3972 311.3081 324.3335 373.8088 465.8019 549.9034 558.0739 643.5328 656.0493 689.3946 712.4359 937.2855 951.2132 1023.7279 1073.7787 1097.2439 1130.4554 1222.0748 1246.7615 1308.3121 1326.9256 1365.5580 1379.5426 1434.6760 1442.0554 1450.9545 1451.8384 1474.0928 1499.4371 1563.1787 2994.7840 3003.6265 3082.4123 3098.2960 3125.8426 3135.8804
redmass: 3.8076 3.5552 4.1779 1.3912 9.7951 8.6452 1.0209 5.7915 16.5312 3.8720 7.6868 4.1384 5.8428 7.0310 3.5250 5.5922 4.0504 10.4655 6.6045 6.7114 8.7652 2.2751 1.7393 1.9094 3.2205 1.2991 10.8563 4.6016 8.6362 4.9355 3.8153 1.2764 1.2359 4.0592 1.4432 1.0482 1.1898 1.0418 5.5839 1.0367 1.0336 1.0967 1.1026 1.1007 1.1021
irintensity: 5.6113 3.9561 1.4713 2.5669 0.6350 0.3552 0.4186 0.0805 1.5780 11.7712 0.1646 1.3872 3.1469 19.9711 1.0862 0.2231 18.2026 0.2163 0.2155 3.7603 23.6130 24.8576 5.3638 29.9857 57.3536 0.4186 136.4509 44.6022 285.6117 60.1953 57.8414 39.5709 70.2116 208.1231 89.0309 22.2115 0.5580 20.5404 180.8544 0.6470 35.3844 6.5715 13.4873 11.0418 13.7671
temp: 298.150 k
press: 1.00000 atm
elementType: 35 35 8 7 7 6 6 6 6 6 6 1 1 1 1 1 1
symmnumber: 1
zpe: 297218.4 jmol-1
zpe.correction: 0.113204 hartree
zpe.thermalcorrener: 0.124970 hartree
zpe.thermalcorrenthalpy: 0.125914 hartree
zpe.thermalcorrgfe: 0.072771 hartree
zpe.sumelectzpe: -443.049186 hartree
zpe.sumelectthermal: -443.037421 hartree
zpe.sumelectthermalent: -443.036477 hartree
zpe.sumelectthermalfe: -443.089620 hartree
dipole: -0.5157 1.4769 0.0084
dipole: 1.5644
quadrupole: -70.5211 -94.2566 -82.3178
quadrupole: -5.3227 0.0135 0.0250
quadrupole: 11.8441 -11.8915 0.0474 -5.3227 0.0135 0.0250
hfenergy: -443.1623909 hartree
pointgroup: C01 [X(C6H6Br2N2O1)]
dipole: 0.0472138 0.6135853 -0.0089603 debye
dipolederiv: -0.602075 0.0964871 -0.1254653 0.191356 -0.0266818 0.0383895 -0.128708 0.0206179 0.0234132 -0.1954875 0.2970213 -0.0519366 0.2389142 -0.4464126 0.061155 -0.0499547 0.0721985 0.0145509 -0.7023819 -0.0677264 -0.0709844 -0.3365163 -1.1258176 -0.0337228 -0.0614725 0.0169328 -0.3257816 -0.239736 0.1407165 -0.0364463 0.1600657 -0.7308871 0.0524768 -0.0364324 0.0506209 -0.0808644 -1.2275331 0.3366836 -0.2102858 0.515412 -0.6270192 0.1124416 -0.2162641 0.0791118 -0.2121272 -0.8936387 -0.5688799 -0.1560294 -0.4782474 -0.3189955 -0.0769887 -0.1597152 -0.0950167 0.0130419 1.2728902 -0.1660705 0.2499504 -0.7473392 0.5563478 -0.1602646 0.2701149 -0.0514338 0.0231554 -0.0030389 -0.0158727 -0.0380058 -0.0951842 0.3565546 -0.0222613 -0.0350773 -0.0078291 0.1981308 1.013894 -0.5893351 0.2278208 -0.0892572 0.9146708 -0.0515389 0.2100158 -0.1459729 -0.0467947 1.517293 0.434001 0.2436268 0.4253052 1.2629693 0.0391491 0.2439075 0.0410881 0.1945772 -0.3672782 0.1620438 -0.0786105 0.2712841 -0.1386282 0.0571198 -0.0823832 0.0365207 -0.000951 0.0261534 0.0929928 0.0957853 0.0227182 0.0197274 0.0099312 0.0895425 -0.0283898 0.0023579 0.1794929 -0.1643984 0.0141305 -0.002226 0.1362979 -0.0004227 0.0081063 -0.0309074 0.1408283 0.0858054 0.0717965 -0.0699285 0.0199308 0.0228679 -0.0060536 -0.0591169 0.054652 -0.0594221 0.0892218 0.0126832 -0.0242137 0.0332628 0.0586679 -0.0863042 0.0052309 -0.0835461 -0.0078087 0.0689797 -0.0152284 0.0573632 0.0006803 0.0704688 0.087738 0.0264779 0.0781698 -0.0000473 -0.0225611 -0.0569143 -0.0267708 -0.130159 0.0158696 -0.0208443 -0.0242715 -0.0068168 0.1237413 unknown
polarizability: 158.3680283|-12.7429063|133.3627241|20.8838653|-5.2952563|53.7250278 unknown
InChI: InChI=1S/C6H6Br2N2O/c1-3(11)4-5(7)9-6(8)10(4)2/h1-2H3
charge 0 multiplicity 1
17 atoms
Br -3.582468 0.285079 -0.483242
Br 1.135296 -2.809753 0.509417
O  1.836842 2.095468 0.469079
N  -0.777788 0.831544 0.023833
N  -1.278792 -1.392476 0.006883
C  0.449231 0.140908 0.278398
C  -1.749323 -0.138451 -0.124833
C  -1.014673 2.289311 -0.070617
C  0.06612 -1.228842 0.253732
C  1.742532 0.824925 0.498354
C  2.982018 -0.014002 0.765008
H  -1.741573 2.597143 0.699882
H  -0.056298 2.800749 0.087176
H  -1.417867 2.534875 -1.067586
H  3.195795 -0.700592 -0.073555
H  2.86272 -0.638745 1.66816
H  3.830626 0.673359 0.902709
