program: Gaussian 09
title: 000178461
version: EM64L-G09RevD.01
frameworkgroup: C1[X(C11H14Br2N2O3)]
method: RPBEPBE
basis: SDD
operation: Freq
keyword: #p
keyword: freq=noraman
keyword: PBEPBE/SDD
title: #p freq=noraman PBEPBE/SDD
converged: YES YES NO NO
title: Mulliken charges:
elementType: Br Br O O O N N C C C C C C C C C C C H H H H H H H H H H H H H H
charge: 0.042793 0.095999 -0.284399 -0.247972 -0.250408 -0.146435 0.070272 0.325445 -0.705728 -0.698202 -0.701855 -0.650723 0.298193 0.437325 0.200758 -0.427900 -0.173502 -0.647419 0.221946 0.214224 0.265962 0.231170 0.229467 0.206277 0.265841 0.212766 0.229372 0.284973 0.276928 0.259014 0.252820 0.312997
chargesum: 0.00000
title: Mulliken charges with hydrogens summed into heavy atoms:
elementType: Br Br O O O N N C C C C C C C C C C C
charge: 0.042793 0.095999 -0.284399 -0.247972 -0.250408 -0.146435 0.070272 0.325445 -0.003596 -0.031288 0.006124 -0.088822 0.298193 0.437325 0.200758 -0.427900 -0.173502 0.177413
polarizability: 2.39038202e+02 1.25057025e+01 1.70946184e+02 2.42785344e+01 -9.76244421e+00 1.21979571e+02
1716.lowfreq: -9.1351 -0.6486 -0.0005 -0.0003 0.0006 4.5210 13.5057 14.4620 27.0134
frequency: 12.6359 14.0939 26.9954 69.0785 76.2458 84.8769 102.2854 105.6192 118.6844 136.8418 140.5916 162.3610 185.1782 223.1371 237.4310 243.5465 245.4787 252.8629 284.7560 301.0324 318.4039 329.3016 336.0513 379.6567 404.2854 429.3222 444.7506 461.3262 534.4385 557.0535 571.9122 644.4137 653.8829 672.6163 706.9933 727.2509 767.6294 808.8870 901.2945 915.5508 923.6668 931.4256 948.6973 955.5727 1029.2845 1033.2168 1043.4836 1091.5650 1116.8700 1128.3288 1163.3234 1192.2852 1225.1483 1253.7721 1258.2775 1269.4902 1292.1773 1310.4710 1328.4321 1365.2139 1376.2551 1380.0152 1402.5373 1426.2154 1444.8962 1446.0212 1453.0230 1466.4532 1467.0040 1470.8954 1473.6055 1478.4213 1496.1445 1500.7182 1560.0315 1625.5740 2991.1153 2991.4714 2996.6742 3005.5845 3025.5001 3082.0409 3084.8943 3088.9939 3096.4377 3099.7593 3099.9770 3113.9605 3118.1953 3142.1202
redmass: 8.4230 4.5054 4.6590 4.3036 3.9571 3.8754 1.5369 3.2914 6.6669 6.1334 10.7884 1.1256 4.4940 1.1141 1.6072 10.0635 2.4469 3.0686 3.4293 3.2955 9.2404 2.8541 3.9651 4.4189 2.7188 2.7021 2.9048 5.0194 4.0084 5.8410 5.7606 4.8272 10.1936 9.8456 6.4205 5.8764 6.0186 3.5070 3.9185 1.5858 1.8714 3.6095 4.5068 1.2050 1.4282 1.4284 2.8621 2.3041 3.8466 1.3087 1.4235 2.1731 10.7263 3.5380 3.0433 2.9696 1.9173 8.8682 4.9441 4.0824 1.2251 1.2334 1.2145 1.1451 1.0582 2.2403 2.0222 1.0502 1.0570 1.0704 1.2696 1.0537 1.0436 1.0557 7.1878 8.9846 1.0363 1.0357 1.0367 1.0344 1.0596 1.0992 1.0991 1.1003 1.0991 1.1005 1.1022 1.1002 1.0994 1.1014
irintensity: 1.0912 0.3612 0.0404 2.7984 5.6542 0.1528 0.4402 0.0882 3.0821 2.3065 0.1183 0.0309 1.9767 0.7856 2.5026 1.0536 0.3249 4.1724 16.3507 9.5050 2.2743 2.1575 0.9326 3.3247 0.6240 1.3326 14.4981 13.5236 3.7026 5.4489 3.5244 6.7443 0.0664 2.1972 17.7501 15.2561 11.5273 24.4966 7.2977 0.4957 2.0460 12.3697 16.2698 0.1576 0.0610 1.8276 44.5868 50.6799 615.9715 3.6322 32.3011 3.9359 150.9564 13.3941 23.5192 32.6850 137.7469 287.4825 51.5237 33.6957 42.0163 36.7601 22.7736 31.2375 0.9026 78.2825 225.2847 7.5280 0.6763 18.3747 1.3882 4.5783 24.1200 28.1225 224.1809 143.0866 22.4252 9.0939 26.8703 32.7778 1.8963 9.9366 14.9632 1.2987 56.5931 27.1849 12.5002 6.0287 17.1508 10.4531
temp: 298.150 k
press: 1.00000 atm
elementType: 35 35 8 8 8 7 7 6 6 6 6 6 6 6 6 6 6 6 1 1 1 1 1 1 1 1 1 1 1 1 1 1
symmnumber: 1
zpe: 621184.8 jmol-1
zpe.correction: 0.236597 hartree
zpe.thermalcorrener: 0.257141 hartree
zpe.thermalcorrenthalpy: 0.258085 hartree
zpe.thermalcorrgfe: 0.183214 hartree
zpe.sumelectzpe: -788.288088 hartree
zpe.sumelectthermal: -788.267544 hartree
zpe.sumelectthermalent: -788.266599 hartree
zpe.sumelectthermalfe: -788.341470 hartree
dipole: -1.7161 0.9363 0.0831
dipole: 1.9567
quadrupole: -99.1552 -132.1866 -125.4558
quadrupole: 10.8840 -2.0241 2.3627
quadrupole: 19.7773 -13.2541 -6.5232 10.8840 -2.0241 2.3627
hfenergy: -788.5246848 hartree
pointgroup: C01 [X(C11H14Br2N2O3)]
dipole: -0.6725207 -0.3737391 0.0257991 debye
polarizability: 228.3221716|-8.3389729|172.3224716|-43.0335509|-2.1800759|131.3193137 unknown
InChI: InChI=1S/C11H14Br2N2O3/c1-11(2,3)18-7(17)5-6(16)8-9(12)14-10(13)15(8)4/h5H2,1-4H3
charge 0 multiplicity 1
32 atoms
Br 0.223508 2.364749 1.278393
Br 5.033468 0.773191 -1.393083
O  -2.810887 -0.080865 0.991076
O  -1.353838 -0.753256 -0.72609
O  1.092411 -2.497799 1.305571
N  2.828311 -0.561797 -0.059217
N  2.645739 1.710481 -0.060263
C  -3.981189 0.288017 0.062656
C  -4.44054 -0.975271 -0.690485
C  -5.039039 0.76753 1.069611
C  -3.536613 1.421146 -0.881785
C  -0.681626 -0.900371 1.651195
C  -1.620723 -0.571346 0.484356
C  1.598576 -0.256735 0.601681
C  0.720095 -1.28705 1.183374
C  1.54878 1.164132 0.565509
C  3.384186 0.646635 -0.429077
C  3.382201 -1.890956 -0.398608
H  -4.68782 -1.783602 0.020191
H  -5.350633 -0.74015 -1.272162
H  -3.663662 -1.331139 -1.385092
H  -4.665656 1.63283 1.643747
H  -5.295791 -0.037845 1.778911
H  -5.956142 1.070447 0.533383
H  -2.76988 1.075317 -1.592277
H  -4.411684 1.78074 -1.453497
H  -3.131058 2.270194 -0.30356
H  -1.092154 -1.776403 2.184167
H  -0.675525 -0.053056 2.357069
H  3.322419 -2.052632 -1.488561
H  4.436548 -1.940418 -0.080552
H  2.796014 -2.652515 0.131018
