program: Gaussian 09
title: 000178449
version: EM64L-G09RevD.01
frameworkgroup: C1[X(C12H14Br2N4O)]
method: RPBEPBE
basis: SDD
operation: Freq
keyword: #p
keyword: freq=noraman
keyword: PBEPBE/SDD
title: #p freq=noraman PBEPBE/SDD
converged: YES YES NO NO
title: Mulliken charges:
elementType: Br Br O N N N N C C C C C C C C C C C C H H H H H H H H H H H H H H
charge: -0.001500 0.062963 -0.415796 -0.157904 -0.057112 0.067890 -0.012665 -0.216903 -0.255148 0.583309 0.303852 -0.713026 -0.468019 -0.200233 -0.469755 -0.648710 -0.420041 0.244272 -0.770032 0.236655 0.258009 0.255254 0.222810 0.226220 0.342450 0.251464 0.288972 0.257172 0.239120 0.241174 0.233768 0.259178 0.232313
chargesum: 0.00000
title: Mulliken charges with hydrogens summed into heavy atoms:
elementType: Br Br O N N N N C C C C C C C C C C C C
charge: -0.001500 0.062963 -0.073346 -0.157904 -0.057112 0.067890 -0.012665 0.019752 0.002861 0.583309 0.303852 -0.008742 -0.468019 -0.200233 -0.218291 0.136553 -0.178867 0.244272 -0.044773
polarizability: 1.76088294e+02 2.09526372e+01 2.23779177e+02 -1.52307944e+00 -5.32511184e+00 1.58596477e+02
1716.lowfreq: -55.3561 -4.1428 -0.0006 -0.0003 -0.0002 6.3681 7.4865 21.0240 23.2476
frequency: -55.3525 20.8730 23.1335 47.5867 68.7257 71.8872 101.7814 114.6907 124.8210 137.0314 156.9419 177.7325 201.6668 223.7278 230.3289 243.1486 253.5040 276.5958 295.0810 323.6907 338.9162 370.3166 378.2077 404.6305 422.0724 430.7685 461.4704 551.9587 566.0162 577.2839 634.7067 639.1059 680.0497 695.5478 753.1493 765.7603 781.3441 835.0256 897.7475 904.6137 945.3147 950.4424 969.8270 975.0650 999.2709 1018.0105 1050.9482 1072.5549 1082.4646 1099.0052 1133.5507 1162.0210 1184.3728 1203.0940 1228.3621 1236.9984 1256.0753 1267.8144 1273.4647 1309.3108 1314.2669 1330.0210 1342.0283 1358.5897 1370.2453 1379.1422 1394.4935 1408.2138 1451.7352 1454.8596 1464.5087 1468.4888 1471.1191 1478.2901 1481.8651 1494.8521 1504.5404 1518.6061 1546.3188 2986.0094 2986.8139 2995.6905 3002.2843 3065.5613 3076.7750 3085.2888 3089.1113 3100.0612 3118.9456 3121.7360 3126.4392 3133.0229 3517.5708
redmass: 1.0290 6.6159 9.1823 5.6561 4.5000 3.8869 6.4459 4.1090 7.3214 11.1405 3.9180 1.1815 4.4532 1.8240 1.9443 3.5527 3.3651 6.0237 5.8395 5.3078 2.6923 1.9570 1.6885 4.0053 4.6515 6.8000 5.0118 3.9614 4.4284 4.7124 8.8436 11.8270 4.9656 9.6616 3.6777 4.1243 3.6543 5.4907 1.8515 2.0075 1.3650 3.4136 2.0563 4.0244 2.9190 1.8867 1.6022 2.5089 2.1431 2.3131 1.3194 2.8415 1.5450 7.9570 2.7042 5.6006 2.0468 2.1869 2.4572 1.4472 1.6616 3.9410 1.8931 1.8209 2.9857 1.2002 1.2439 1.6982 1.2629 1.3967 1.6624 1.0459 1.2246 1.0610 1.1342 1.1923 3.4666 4.5236 5.4844 1.0350 1.0382 1.0345 1.0835 1.0974 1.0868 1.0989 1.1035 1.1003 1.0982 1.1000 1.0924 1.0929 1.0662
irintensity: 0.4996 0.5538 0.0253 0.1653 1.1403 0.3096 1.5679 3.4374 5.0128 0.0808 0.4846 0.7955 0.2569 1.3217 0.2870 1.7169 4.0112 5.5015 2.9999 2.8691 4.5066 56.0084 87.7153 10.1841 1.9931 4.6733 31.2105 0.3815 3.9439 0.8525 0.2229 0.3146 8.9687 1.6159 5.3773 20.4189 0.2923 0.5585 3.3112 27.6918 2.8807 113.5010 6.5993 15.3830 20.4867 19.5453 9.3525 10.3113 70.0614 6.2278 6.4760 98.9706 27.4225 61.6138 9.0559 2.6257 2.0070 10.6131 16.2871 2.1860 11.4541 52.4347 28.2196 39.7996 78.9400 14.0163 22.4781 17.2414 23.0787 40.0974 37.0565 16.5412 39.3917 11.8227 21.4071 15.6982 4.1987 9.7797 0.7702 26.1618 13.9692 32.2695 5.0841 15.1828 5.1558 26.7316 3.1808 13.0420 6.9160 2.6408 33.7172 4.0891 14.3943
temp: 298.150 k
press: 1.00000 atm
elementType: 35 35 8 7 7 7 7 6 6 6 6 6 6 6 6 6 6 6 6 1 1 1 1 1 1 1 1 1 1 1 1 1 1
symmnumber: 1
zpe: 647401.6 jmol-1
zpe.correction: 0.246582 hartree
zpe.thermalcorrener: 0.265802 hartree
zpe.thermalcorrenthalpy: 0.266746 hartree
zpe.thermalcorrgfe: 0.196057 hartree
zpe.sumelectzpe: -785.385549 hartree
zpe.sumelectthermal: -785.366329 hartree
zpe.sumelectthermalent: -785.365385 hartree
zpe.sumelectthermalfe: -785.436074 hartree
dipole: 2.7490 -3.0868 2.7218
dipole: 4.9491
quadrupole: -134.1185 -115.9132 -138.2964
quadrupole: 1.9994 -4.0888 -5.9043
quadrupole: -4.6758 13.5295 -8.8537 1.9994 -4.0888 -5.9043
hfenergy: -785.6321311 hartree
pointgroup: C01 [X(C12H14Br2N4O1)]
dipole: -1.3533057 0.1224285 1.3945882 debye
polarizability: 168.2216029|-3.1926265|216.7999044|-3.536787|29.5638214|173.4424405 unknown
InChI: InChI=1S/C12H14Br2N4O/c1-6-4-16-8(5-15-6)7(2)10(19)9-11(13)17-12(14)18(9)3/h4-5,7,10,19H,1-3H3
charge 0 multiplicity 1
33 atoms
Br 2.259091 -1.339386 -2.569046
Br 3.070286 3.417426 0.61728
O  1.77672 -2.745706 0.801749
N  1.793351 0.800637 0.917226
N  -1.60209 -0.026217 0.982682
N  2.731886 1.133575 -1.129895
N  -3.07706 0.462563 -1.399325
C  -0.453074 -1.978523 -0.035551
C  0.853645 -1.591882 0.727925
C  1.545687 -0.374573 0.168987
C  -1.413061 -0.80569 -0.133419
C  -1.140765 -3.174546 0.674985
C  2.146194 -0.118034 -1.071205
C  2.501066 1.660692 0.080446
C  -2.149323 -0.533804 -1.314689
C  1.376023 1.027251 2.310411
C  -2.52103 0.975585 0.896576
C  -3.279242 1.229016 -0.279699
C  -4.30961 2.331231 -0.352465
H  -0.178434 -2.284769 -1.063905
H  0.581656 -1.411789 1.780049
H  -0.414753 -3.992717 0.81696
H  -1.9938 -3.549265 0.081998
H  -1.518749 -2.864696 1.66648
H  2.174127 -2.887858 -0.097847
H  -1.990621 -1.127744 -2.221807
H  0.30507 0.784697 2.412245
H  1.970203 0.401122 2.998489
H  1.539392 2.085849 2.563011
H  -2.657533 1.594139 1.791047
H  -3.85583 3.320697 -0.158145
H  -4.76113 2.342636 -1.356331
H  -5.110993 2.185081 0.395288
