program: Gaussian 09
title: 000178508
version: EM64L-G09RevD.01
frameworkgroup: C1[X(C25H19N5)]
method: RPBEPBE
basis: SDD
operation: Freq
keyword: #pfreq=noraman
keyword: PBEPBE/SDD
title: #p freq=noraman PBEPBE/SDD
converged: YES YES NO NO
title: Mulliken charges:
elementType: N N N N N C C C C C C C C C C C C C C C C C C C C C C C C C H H H H H H H H H H H H H H H H H H H
charge: -0.204659 -0.026070 0.028616 -0.065359 -0.642433 0.104468 0.133623 0.316339 0.213622 -0.693814 -0.058823 0.319305 0.107726 0.425281 -0.431407 -0.367924 -0.519307 -0.443556 -0.828553 0.156278 -0.361171 -0.459083 -0.283701 -0.214321 -0.265181 -0.123506 -0.278703 -0.250521 0.152752 -0.394770 0.267593 0.290064 0.255385 0.264303 0.239262 0.231753 0.239213 0.242702 0.241243 0.279491 0.244983 0.236654 0.290800 0.234250 0.240460 0.235494 0.243361 0.339783 0.338057
chargesum: 0.00000
title: Mulliken charges with hydrogens summed into heavy atoms:
elementType: N N N N N C C C C C C C C C C C C C C C C C C C C C C C C C
charge: -0.204659 -0.026070 0.028616 -0.065359 0.035406 0.104468 0.133623 0.316339 0.213622 -0.136156 -0.058823 0.319305 0.107726 0.425281 -0.176023 -0.103621 -0.280045 -0.211803 -0.105395 0.156278 -0.081679 -0.214100 -0.047048 0.076478 -0.030931 -0.123506 -0.038243 -0.015027 0.152752 -0.151408
polarizability: 3.96063246e+02 -1.79524407e+01 4.26905669e+02 -1.46934129e+00 6.17875645e+00 1.84694317e+02
1716.lowfreq: -0.3805 -0.0009 -0.0007 0.0006 3.1958 7.4832 17.1937 33.4112 34.2923
frequency: 17.1458 33.4066 34.2873 55.5165 60.6736 94.2426 105.3794 124.0274 128.4091 142.3627 176.5920 192.1022 204.4281 205.7503 221.1033 276.8053 300.2624 304.7400 326.4030 339.3069 362.5802 364.8338 368.9498 391.3996 418.9009 446.2496 451.6852 484.6452 512.3089 514.9493 520.2094 521.0459 531.1905 538.6376 561.8417 565.8236 580.0979 588.0640 592.7309 607.6810 620.3140 636.9471 652.3639 670.7829 696.2612 705.2016 729.6082 743.7558 766.4969 771.0769 777.5028 784.0710 792.0818 813.4188 820.6138 840.1395 841.7828 844.2106 877.8138 889.2463 891.9695 922.5449 930.1837 957.8347 962.0035 964.5470 982.1888 991.6306 993.2756 999.2529 1020.1303 1028.2798 1037.1605 1048.6061 1054.4906 1070.1646 1080.9522 1101.0120 1113.7468 1154.6292 1183.7566 1184.0971 1188.7429 1190.3490 1219.1366 1229.5847 1237.8029 1250.6391 1252.7946 1273.9832 1294.1524 1296.5625 1304.6396 1315.7155 1336.0284 1346.8980 1349.8376 1366.8832 1380.1318 1387.8019 1393.4492 1401.6012 1416.7776 1418.1551 1429.9525 1432.6570 1436.5634 1454.2556 1471.4449 1482.2282 1499.8432 1502.5228 1511.8024 1516.6785 1548.2431 1561.8306 1567.3342 1588.0116 1612.4855 1617.2713 1622.7702 1631.8443 2977.4645 2985.2146 3035.1764 3056.0150 3125.2307 3125.7865 3130.5911 3134.4887 3140.8860 3147.5644 3161.9059 3162.5415 3162.9663 3175.0720 3175.6180 3186.2376 3241.3434 3546.9746 3706.3161
redmass: 6.4209 4.7817 5.7848 3.1858 4.1863 4.2153 3.1517 3.9806 3.9799 1.6876 4.7862 4.2023 6.7038 5.2983 4.3280 4.6045 4.7409 6.2442 3.8885 3.8570 1.1837 3.9286 4.1706 2.6016 3.3190 4.3479 3.8708 5.4531 3.5744 6.2240 1.1796 5.3952 4.8696 4.8937 5.0835 3.8667 5.0016 3.6502 4.0804 4.1332 4.2846 6.2359 6.1048 9.3592 3.6384 4.6171 4.4545 2.9712 1.3763 3.4209 1.9662 2.9490 7.5856 3.4488 2.2098 3.3912 1.5803 2.2731 3.8381 2.4250 1.5826 3.3308 1.4255 2.1866 1.3861 1.3796 1.4246 1.3782 1.7498 2.0256 3.5648 2.6454 1.6789 2.2948 2.6395 2.2991 2.8994 3.6662 2.4628 1.6180 1.3323 1.1968 1.1616 1.7582 3.3040 1.2467 1.9713 1.6855 2.2732 1.7246 2.2950 8.8123 3.7766 2.4688 2.5640 3.6019 4.8997 3.3865 3.9492 2.1521 4.8167 1.2387 2.2870 2.2676 2.7024 2.9596 4.4758 2.2360 1.4350 1.1253 1.9911 1.7532 1.3777 7.2462 5.8761 5.7138 7.6060 2.1692 5.9987 5.9537 2.1546 6.4539 1.0609 1.0429 1.1004 1.0966 1.0926 1.0877 1.0890 1.0855 1.0902 1.0889 1.0976 1.0919 1.0947 1.0969 1.0951 1.0938 1.0984 1.0457 1.1036
irintensity: 0.1059 0.6427 3.1923 0.8195 0.3900 0.1979 0.1987 0.1393 2.7653 2.2954 1.6027 1.0827 0.1794 0.1300 1.5511 0.4093 2.5050 0.4675 5.1297 0.8297 123.6910 0.8651 2.3924 1.0102 2.3314 2.7799 0.6201 2.7461 2.9438 1.0122 84.6215 3.3772 4.7328 4.3803 1.0136 0.7117 6.3727 0.2502 0.1253 35.7366 0.8733 2.6633 1.3239 1.2507 4.8683 7.1518 9.1826 32.7702 59.9318 8.2362 28.2588 0.6348 1.3866 1.6430 22.5195 22.3407 12.6574 12.0102 2.2864 7.9858 9.3046 6.8076 12.2135 5.8291 0.6591 1.8554 1.0544 0.0251 0.2351 3.1757 9.2325 2.7385 1.6231 5.0922 1.6064 9.3224 0.8140 11.9508 3.0099 0.7183 28.5931 2.0095 5.6348 117.4233 25.7720 0.5566 4.0987 5.0685 7.0095 0.8196 1.9402 12.4070 60.8310 7.2783 87.9590 7.8831 18.6486 2.7982 5.9559 3.3528 4.6230 10.1315 31.2101 82.2880 0.6356 45.2129 5.8996 3.3261 8.3257 9.6578 4.6594 55.7787 18.2109 91.9406 2.0696 0.1193 4.7922 21.1754 1.9964 0.2007 424.9509 2.4535 19.4839 28.0898 4.7630 13.7893 14.7818 3.6759 9.0683 0.1282 14.9375 4.9204 30.3475 31.5459 22.5634 39.7727 19.5064 4.8059 0.9161 70.7107 42.8012
temp: 298.150 k
press: 1.00000 atm
elementType: 7 7 7 7 7 6 6 6 6 6 6 6 6 6 6 6 6 6 6 6 6 6 6 6 6 6 6 6 6 6 1 1 1 1 1 1 1 1 1 1 1 1 1 1 1 1 1 1 1
symmnumber: 1
zpe: 1004442.7 jmol-1
zpe.correction: 0.382572 hartree
zpe.thermalcorrener: 0.405646 hartree
zpe.thermalcorrenthalpy: 0.406590 hartree
zpe.thermalcorrgfe: 0.329609 hartree
zpe.sumelectzpe: -1235.816540 hartree
zpe.sumelectthermal: -1235.793467 hartree
zpe.sumelectthermalent: -1235.792522 hartree
zpe.sumelectthermalfe: -1235.869503 hartree
dipole: 7.8158 1.2001 5.4739
dipole: 9.6173
quadrupole: -184.1045 -152.6295 -183.8678
quadrupole: -7.7116 -19.8211 -2.7773
quadrupole: -10.5706 20.9044 -10.3338 -7.7116 -19.8211 -2.7773
hfenergy: -1236.1991124 hartree
pointgroup: C01 [X(C25H19N5)]
dipole: -3.1453857 -0.5190331 2.0380601 debye
polarizability: 396.7148437|-18.3535169|425.2738631|10.9143116|-12.7335307|185.6745263 unknown
InChI: InChI=1S/C25H19N5/c1-15-17-7-4-5-9-20(17)21(12-30-14-29-25-23(30)24(26)27-13-28-25)22-18(15)11-10-16-6-2-3-8-19(16)22/h2-11,13-14H,12,26H2,1H3
charge 0 multiplicity 1
49 atoms
N  1.76094 0.519719 -0.053883
N  2.853575 0.951208 -2.032323
N  5.166732 0.722037 -1.163494
N  5.299078 0.176962 1.228597
N  3.453492 -0.12364 2.63525
C  -0.756251 0.490673 0.32714
C  -1.602114 -0.629166 0.075178
C  -3.03593 -0.383357 -0.078748
C  -1.268652 1.830017 0.202448
C  0.64292 0.333132 0.910696
C  -3.561359 0.936153 -0.190301
C  -2.673756 2.059267 -0.106609
C  -1.127753 -2.031145 -0.00207
C  -2.085343 -3.107239 0.088519
C  -3.946714 -1.515154 -0.045786
C  -0.407243 2.975324 0.35966
C  -3.499962 -2.807406 0.100766
C  -3.122773 3.42016 -0.262184
C  -5.06118 1.122081 -0.370389
C  3.139324 0.434668 0.223697
C  0.234039 -2.401331 -0.241639
C  -1.650283 -4.465173 0.083594
C  -0.882468 4.275367 0.20848
C  1.665009 0.832357 -1.417276
C  -2.257977 4.50067 -0.110629
C  3.80252 0.707296 -1.020986
C  0.644359 -3.745507 -0.267179
C  -0.295563 -4.79034 -0.068868
C  3.93725 0.160161 1.371896
C  5.828469 0.453073 -0.008708
H  0.768368 1.081916 1.716289
H  0.737025 -0.669673 1.362703
H  -5.021146 -1.327396 -0.105494
H  0.658198 2.830923 0.561275
H  -4.210108 -3.639559 0.170878
H  -4.167765 3.621682 -0.509227
H  -5.343396 2.169554 -0.539024
H  -5.438468 0.541349 -1.231607
H  -5.61557 0.779978 0.524363
H  0.979424 -1.642446 -0.485005
H  -2.403101 -5.257402 0.172204
H  -0.200062 5.12502 0.316172
H  0.699384 0.960072 -1.9007
H  -2.627611 5.523291 -0.240815
H  1.695112 -3.982515 -0.465177
H  0.029467 -5.836025 -0.076718
H  6.921506 0.452844 -0.059976
H  2.463774 -0.186562 2.850081
H  4.144484 -0.303315 3.361831
