program: Gaussian 09
title: 000178442
version: EM64L-G09RevD.01
frameworkgroup: C1[X(C12H13BrN4OS)]
method: RPBEPBE
basis: SDD
operation: Freq
keyword: #p
keyword: freq=noraman
keyword: PBEPBE/SDD
title: #p freq=noraman PBEPBE/SDD
converged: YES YES NO NO
title: Mulliken charges:
elementType: Br S O N N N N C C C C C C C C C C C C H H H H H H H H H H H H H
charge: 0.042701 0.259405 -0.254366 -0.169628 0.043786 -0.047992 0.009298 0.403000 -0.659430 0.158548 -0.201311 -0.422627 0.210593 -0.649049 -0.363036 0.196677 -0.378922 -0.782797 -0.803305 0.290016 0.261152 0.249384 0.314121 0.243857 0.255856 0.248504 0.231304 0.232307 0.253940 0.290282 0.244621 0.293111
chargesum: 0.00000
title: Mulliken charges with hydrogens summed into heavy atoms:
elementType: Br S O N N N N C C C C C C C C C C C C
charge: 0.042701 0.259405 -0.254366 -0.169628 0.043786 -0.047992 0.009298 0.403000 -0.108262 0.158548 -0.201311 -0.422627 0.210593 0.158312 -0.107181 0.196677 -0.130418 -0.065246 0.024709
polarizability: 3.04730539e+02 3.59908444e+00 1.86784468e+02 -1.79881606e-01 7.99242010e+00 1.22910746e+02
1716.lowfreq: -68.7016 -6.9288 -4.0499 -0.0018 -0.0013 -0.0008 2.7323 11.2912 18.2747
frequency: -68.6977 10.9379 18.2390 44.4659 48.5206 54.8349 80.7881 101.4282 111.5279 116.2939 122.5623 137.0245 170.4604 190.5186 225.6859 240.1399 251.8372 261.7757 286.0793 311.7738 330.3873 388.6408 406.4790 455.5830 490.0989 520.8531 541.6354 553.0172 569.3336 609.9075 654.5938 666.4362 678.9339 695.3399 728.1817 746.6282 805.8290 881.5026 913.1042 931.0079 940.1915 945.0608 975.2554 986.9294 990.9043 1004.1689 1018.4360 1049.1777 1107.7834 1128.5379 1137.0986 1166.9992 1217.7475 1232.0486 1238.4034 1268.2588 1279.1941 1289.5813 1310.1274 1344.3687 1361.4025 1371.6676 1389.8957 1397.1253 1410.6561 1418.6153 1436.3571 1446.6995 1449.4419 1455.2196 1463.4754 1468.2036 1474.0471 1498.2851 1517.8051 1542.6872 1555.3881 2986.2690 2987.0850 2992.8970 3031.9436 3063.6388 3065.7393 3081.1401 3115.4008 3134.0440 3140.3031 3157.8132 3160.1757 3167.2907
redmass: 1.0263 5.4823 5.3387 3.0710 6.1720 4.8976 3.5861 1.3657 1.4809 8.2137 3.1095 2.5897 3.2124 6.5144 5.4490 6.0784 4.5577 2.4381 10.4792 7.1771 4.1269 2.8681 6.2165 7.8302 6.6409 3.6436 4.4312 5.2755 7.8199 5.9189 7.6363 10.4445 7.4813 6.6843 6.2524 3.6863 3.0095 1.6587 2.6817 1.7457 3.3050 3.0763 4.4129 1.1779 2.8805 1.2642 2.5204 1.5944 2.1273 1.3048 2.3547 1.3901 3.3481 4.0906 8.8339 2.3805 2.1928 4.2097 2.4413 1.4526 3.0585 3.0183 1.3407 1.9477 1.9813 1.6476 1.0517 1.6995 1.6896 1.3671 1.1844 1.0460 1.2154 1.0507 6.1659 4.6426 6.2973 1.0385 1.0636 1.0351 1.0277 1.0942 1.0974 1.1023 1.0985 1.0922 1.1001 1.0939 1.1050 1.1064
irintensity: 0.4376 0.8716 0.1738 0.2814 0.8636 1.7868 7.7544 0.1241 1.6501 1.3053 0.2370 0.3301 0.8763 0.7400 7.7290 1.1662 7.2507 2.1732 3.3182 0.0367 13.6119 0.6797 0.1116 13.4959 24.6842 1.0826 0.7421 2.3412 0.1757 14.2850 6.4037 1.0682 0.3607 15.3415 0.3031 4.5308 4.1369 12.1900 24.6648 13.3926 32.7249 14.3375 20.3198 5.8099 11.8949 4.3158 35.5713 9.2488 35.8563 1.7766 15.7215 3.9406 101.8183 13.9599 132.4878 12.1660 67.5634 156.1933 186.0670 7.5704 28.4298 74.1761 21.9547 8.1340 44.9693 70.6806 15.4625 36.1801 306.7522 82.0598 32.2904 15.3448 4.9819 19.5519 30.0304 17.2295 234.9911 21.5616 7.4181 32.6460 19.0784 5.8517 16.3482 14.6223 7.7035 29.1819 14.4231 14.9908 5.8175 6.6234
temp: 298.150 k
press: 1.00000 atm
elementType: 35 16 8 7 7 7 7 6 6 6 6 6 6 6 6 6 6 6 6 1 1 1 1 1 1 1 1 1 1 1 1 1
symmnumber: 1
zpe: 614422.2 jmol-1
zpe.correction: 0.234021 hartree
zpe.thermalcorrener: 0.253421 hartree
zpe.thermalcorrenthalpy: 0.254365 hartree
zpe.thermalcorrgfe: 0.181555 hartree
zpe.sumelectzpe: -1169.416830 hartree
zpe.sumelectthermal: -1169.397430 hartree
zpe.sumelectthermalent: -1169.396486 hartree
zpe.sumelectthermalfe: -1169.469295 hartree
dipole: 2.6971 -0.0856 1.2149
dipole: 2.9594
quadrupole: -106.0414 -130.4458 -129.2538
quadrupole: -11.2524 -7.9638 -4.3749
quadrupole: 15.8723 -8.5321 -7.3401 -11.2524 -7.9638 -4.3749
hfenergy: -1169.6508506 hartree
pointgroup: C01 [X(C12H13Br1N4O1S1)]
dipole: -1.0572962 0.1386758 -0.4674309 debye
polarizability: 304.8208946|-1.5140913|182.7098518|0.5448386|17.3742668|126.8950068 unknown
InChI: InChI=1S/C12H13BrN4OS/c1-7-5-14-6-8(15-7)4-9(18)10-11(13)16-12(19-3)17(10)2/h5-6H,4H2,1-3H3
charge 0 multiplicity 1
32 atoms
Br -1.541319 2.510294 1.570805
S  -5.162714 -1.158451 -0.720827
O  0.431382 -1.752739 -0.019476
N  -2.409765 -1.096924 -0.27141
N  -3.490977 0.772379 0.449791
N  3.209495 0.835594 -0.212612
N  4.35719 -1.382419 1.151402
C  -1.401273 -0.232984 0.26808
C  1.019386 0.464627 0.825573
C  0.02259 -0.595884 0.32591
C  -3.618273 -0.444432 -0.142316
C  -2.146593 0.900948 0.695259
C  2.466683 0.064461 0.641356
C  -2.259373 -2.420615 -0.912119
C  3.044782 -1.043608 1.311498
C  4.52915 0.506442 -0.38949
C  5.087253 -0.6024 0.302549
C  5.346287 1.358286 -1.333716
C  -6.323739 0.224989 -0.178881
H  0.857702 1.416955 0.291426
H  0.80155 0.666462 1.893672
H  -2.458232 -2.339078 -1.995635
H  -1.233618 -2.77429 -0.748464
H  -2.982062 -3.124504 -0.463022
H  2.452351 -1.677076 1.97739
H  6.140846 -0.874364 0.174859
H  6.195914 1.836573 -0.811979
H  5.766649 0.75412 -2.158789
H  4.707734 2.14598 -1.762712
H  -6.273813 0.337133 0.912353
H  -7.325104 -0.096844 -0.502251
H  -6.027189 1.16107 -0.670226
