program: Gaussian 09
title: 000178546
version: EM64L-G09RevD.01
frameworkgroup: C1[X(C25H29NO5)]
method: RPBEPBE
basis: SDD
operation: Freq
keyword: #p
keyword: freq=noraman
keyword: PBEPBE/SDD
title: #p freq=noraman PBEPBE/SDD
converged: YES YES NO NO
title: Mulliken charges:
elementType: O O O O O N C C C C C C C C C C C C C C C C C C C C C C C C C H H H H H H H H H H H H H H H H H H H H H H H H H H H H H
charge: -0.216302 -0.206415 -0.328453 -0.187435 -0.242570 -0.017095 0.155694 0.154613 0.097440 0.093825 -0.706433 -0.709038 -0.697657 -0.695551 -0.710069 -0.701101 0.325031 0.328861 -0.361731 -0.335223 -0.351688 -0.338342 0.315272 -0.369087 -0.402119 0.255588 -0.340680 -0.386521 0.115752 0.163967 -0.480875 0.219773 0.216818 0.229355 0.224563 0.215108 0.227656 0.230284 0.197675 0.227866 0.223895 0.200751 0.235725 0.225566 0.217458 0.227069 0.233038 0.221353 0.215926 0.283467 0.222647 0.283530 0.230402 0.268349 0.253668 0.276520 0.270891 0.231889 0.229146 0.237953
chargesum: 0.00000
title: Mulliken charges with hydrogens summed into heavy atoms:
elementType: O O O O O N C C C C C C C C C C C C C C C C C C C C C C C C C
charge: -0.216302 -0.206415 -0.328453 -0.187435 -0.242570 -0.017095 0.155694 0.154613 0.097440 0.093825 -0.040486 -0.041711 -0.041832 -0.035180 -0.039976 -0.030784 0.325031 0.328861 -0.078265 -0.112576 -0.068158 -0.107939 0.315272 -0.100738 -0.148452 0.255588 -0.064160 -0.115630 0.115752 0.163967 0.218112
polarizability: 4.67479239e+02 -1.33667758e+01 3.21592661e+02 4.20219897e+00 8.68416861e+00 2.18564408e+02
1716.lowfreq: -14.9136 -8.5819 -4.5657 -0.0010 -0.0006 -0.0005 1.6817 6.7254 12.1146
frequency: -12.2389 -2.8005 11.7380 12.9533 27.3835 40.1726 55.2947 63.5954 65.7357 73.4733 84.8555 92.9355 102.3564 118.4217 123.8259 131.7955 134.4598 145.1172 168.8354 181.4133 187.2723 193.4826 197.2008 228.9239 237.4589 241.0328 248.6442 254.3354 265.7256 270.9945 277.0278 291.7106 320.4592 335.8236 351.8730 354.9203 360.5122 367.5706 377.6514 382.0984 393.5750 409.4635 410.5126 442.0457 462.1750 470.0362 494.0765 510.0699 522.0739 541.7926 578.3879 590.0288 608.3289 631.3290 633.0661 661.9493 687.3280 697.7554 703.8327 714.3287 769.8887 782.5151 791.7278 807.1645 811.8688 827.2079 847.9017 858.7804 866.6903 883.0310 885.8933 927.3739 928.0535 930.8578 930.9162 944.8856 947.4794 947.9764 952.4834 975.7922 985.4091 989.3641 990.8699 1002.3372 1012.7859 1014.7823 1017.9413 1020.8028 1021.4984 1024.0129 1029.6048 1032.1709 1112.2304 1122.6383 1124.1272 1153.8859 1170.4454 1172.4679 1190.3427 1197.1964 1198.4155 1201.9091 1215.1768 1215.8902 1231.3062 1267.3216 1270.5071 1303.2906 1303.7019 1306.8796 1364.8515 1373.7395 1378.9187 1379.1336 1379.6574 1382.3250 1405.5898 1405.7049 1409.4411 1416.2564 1420.2098 1448.3345 1451.4937 1451.7776 1461.1013 1461.5171 1468.4971 1469.5043 1470.9461 1474.0563 1475.8144 1478.1658 1478.5469 1486.4053 1489.4503 1496.1616 1497.3259 1524.8368 1544.4907 1548.7137 1575.7801 1577.1297 1617.3803 1617.7713 1656.8928 2983.5860 2983.9002 2985.4093 2986.1210 2990.8071 2991.2331 2993.2661 3071.7706 3072.9107 3074.5064 3076.1602 3087.5726 3088.4245 3095.3226 3097.9670 3100.0424 3102.1297 3102.2667 3103.8165 3104.7816 3132.4434 3153.1788 3154.5895 3159.5526 3160.4208 3172.8509 3182.5672 3188.5961 3188.7435
redmass: 4.3335 4.5515 4.5408 4.2541 3.6258 4.3161 5.7110 5.6579 3.3599 3.3931 2.7810 2.8200 3.4028 1.9589 2.1490 1.9791 1.2249 3.0691 3.7785 1.2806 1.1697 3.2344 2.4975 2.9717 2.2559 1.6229 1.7031 2.8611 2.1896 3.2230 3.7317 4.0759 5.4756 3.7373 3.3701 3.1041 3.8300 3.7456 2.4239 2.3754 3.7759 2.8708 2.9270 4.9069 4.2673 4.9064 4.6065 5.0657 3.5624 4.5151 5.0775 4.6029 5.3678 7.1243 7.1580 5.4874 6.2244 4.3052 3.8145 5.0612 4.5280 4.6907 6.1244 3.6761 3.1494 5.7258 1.3811 1.3597 6.6312 1.5343 1.5689 1.6742 1.7041 1.7224 1.7042 3.3033 2.6814 1.3357 1.2048 1.3502 8.7338 7.5281 1.3850 4.2830 1.4258 1.3690 2.1686 1.4537 1.4293 2.0562 1.5598 2.1701 1.2498 1.3484 1.3538 1.4818 1.9670 2.1456 1.4856 2.7544 2.8597 1.4442 2.8950 2.8303 3.2117 3.6921 3.5236 1.2907 1.3322 3.9517 4.3045 4.2855 1.1959 1.2429 1.1986 1.1798 1.2983 1.6798 2.0290 3.5536 1.1725 1.0527 1.0495 1.0495 1.0524 1.0557 1.0508 1.0493 1.0516 1.0856 1.0551 1.1337 1.0984 2.0411 2.1778 1.1032 1.1067 9.1025 7.3281 8.0297 8.1489 8.1008 6.3736 6.3847 12.6276 1.0364 1.0359 1.0364 1.0367 1.0364 1.0364 1.0287 1.1000 1.1000 1.0995 1.0995 1.0996 1.0994 1.0985 1.0988 1.1058 1.0982 1.0986 1.0975 1.0977 1.1036 1.0881 1.0902 1.0890 1.0887 1.0963 1.0952 1.0940 1.0940
irintensity: 1.4528 0.8966 0.0760 1.2824 0.2246 0.2250 0.7248 0.6971 0.7879 1.7440 3.3088 0.1890 1.8781 0.6869 1.1208 1.9389 0.4258 1.7519 2.1659 0.5276 0.5974 0.5123 0.1060 1.2888 0.6139 0.2310 0.0789 2.6980 0.1867 1.8004 1.0715 0.1898 0.4691 2.7803 1.8677 3.9353 12.2034 10.1250 0.2584 0.3883 10.0472 0.4342 0.0691 26.1404 3.1630 3.8963 12.1371 3.9771 22.8850 12.3464 1.3055 2.2318 3.1073 0.5195 0.5225 13.7123 7.8582 10.1430 21.8353 12.5482 15.4359 0.6041 5.0077 5.5313 1.1318 0.3452 12.3545 19.5898 63.0479 38.7447 24.8401 5.7305 1.6203 4.8194 2.4499 379.7432 121.9162 19.0973 1.2443 0.5711 426.3295 157.3814 2.5898 139.0225 3.1728 0.5202 16.5684 1.4041 1.9525 154.7676 29.3675 200.9500 0.1133 4.3373 4.0714 13.9505 181.9758 65.5424 288.9250 10.4925 6.5056 33.2136 33.4832 2.6609 319.7972 29.0854 64.4930 0.5231 1.8005 29.5471 6.7712 15.7563 17.4091 12.3783 16.4832 19.6028 29.2774 13.2935 41.1228 24.3358 2.9516 12.0762 0.7358 0.8392 0.3063 0.1245 2.9237 2.5674 31.1671 10.6912 8.3028 23.9144 8.8192 40.9911 3.5928 25.8272 29.5500 3.9809 154.7469 62.1074 23.1543 52.0721 12.5296 21.8153 192.7652 26.8617 29.1076 19.9867 16.9643 52.5438 40.6218 85.6356 12.0120 12.2552 23.7515 22.5171 48.1050 45.8817 23.4484 10.7799 30.5534 58.0305 41.8242 51.8890 38.7102 14.3230 0.4887 0.0213 0.4581 3.6724 4.8531 5.7301 7.4818 10.7441
temp: 298.150 k
press: 1.00000 atm
elementType: 8 8 8 8 8 7 6 6 6 6 6 6 6 6 6 6 6 6 6 6 6 6 6 6 6 6 6 6 6 6 6 1 1 1 1 1 1 1 1 1 1 1 1 1 1 1 1 1 1 1 1 1 1 1 1 1 1 1 1 1
symmnumber: 1
zpe: 1263148.2 jmol-1
zpe.correction: 0.481108 hartree
zpe.thermalcorrener: 0.512420 hartree
zpe.thermalcorrenthalpy: 0.513364 hartree
zpe.thermalcorrgfe: 0.416661 hartree
zpe.sumelectzpe: -1398.591062 hartree
zpe.sumelectthermal: -1398.559750 hartree
zpe.sumelectthermalent: -1398.558805 hartree
zpe.sumelectthermalfe: -1398.655508 hartree
dipole: -3.7043 -1.0720 1.5436
dipole: 4.1538
quadrupole: -197.4050 -160.3566 -190.8035
quadrupole: -10.1467 -16.8935 -7.0035
quadrupole: -14.5499 22.4984 -7.9485 -10.1467 -16.8935 -7.0035
hfenergy: -1399.0721698 hartree
pointgroup: C01 [X(C25H29N1O5)]
dipole: 1.4643154 0.4925091 0.5327956 debye
polarizability: 467.5771224|-10.1032248|319.7500665|-11.8085101|-13.8736519|220.3091195 unknown
InChI: InChI=1S/C25H29NO5/c1-24(2,3)20(27)16-8-12-18(13-9-16)22(26-30-7)31-23(29)19-14-10-17(11-15-19)21(28)25(4,5)6/h8-15H,1-7H3
charge 0 multiplicity 1
60 atoms
O  -7.432017 0.131563 0.120576
O  5.900802 1.569874 -2.282905
O  -0.122942 -1.119839 -0.192521
O  0.705877 -1.636807 1.943887
O  0.075586 -3.753483 -0.097009
N  -1.265265 -3.237054 -0.005878
C  -6.627876 2.434063 0.238326
C  6.912326 2.068094 -0.115982
C  -6.417169 0.892879 0.148036
C  5.79337 1.479693 -1.023577
C  -6.104596 3.128454 -1.057829
C  -5.938881 3.014455 1.51125
C  -8.149377 2.716963 0.347509
C  7.88585 2.884598 -1.006353
C  6.321274 3.0216 0.964652
C  7.724022 0.906084 0.540571
C  -5.046422 0.246458 0.096452
C  4.546504 0.805468 -0.471928
C  -5.015567 -1.180561 0.112474
C  -3.803415 0.933694 0.030722
C  3.47745 0.60781 -1.392426
C  4.378569 0.345358 0.864469
C  -2.568981 -1.189626 0.009034
C  -3.808615 -1.889591 0.069683
C  -2.584693 0.229378 -0.013766
C  2.127646 -0.468389 0.335938
C  2.28064 -0.014191 -0.999921
C  3.1872 -0.289314 1.261063
C  -1.29081 -1.919526 -0.029428
C  0.891989 -1.143762 0.816631
C  0.016658 -5.222889 0.02784
H  -5.020359 3.010574 -1.215651
H  -6.323808 4.210956 -1.000502
H  -6.620801 2.725453 -1.948238
H  -4.845709 2.87782 1.523333
H  -6.147359 4.098803 1.57146
H  -6.346629 2.540833 2.422985
H  -8.692654 2.32992 -0.530964
H  -8.315883 3.807856 0.419115
H  -8.582889 2.231911 1.238697
H  7.363423 3.714343 -1.513439
H  8.692632 3.305528 -0.378341
H  8.335552 2.253557 -1.790639
H  5.761301 3.849679 0.492473
H  7.15071 3.464518 1.546176
H  5.643007 2.517475 1.671554
H  8.147501 0.241584 -0.234003
H  8.564273 1.337498 1.115579
H  7.127955 0.285982 1.230241
H  -5.974212 -1.706575 0.159168
H  -3.765771 2.024059 0.007526
H  3.622161 0.950404 -2.421561
H  5.17534 0.459068 1.601637
H  -3.801162 -2.983205 0.086416
H  -1.638403 0.774823 -0.070224
H  1.465813 -0.161663 -1.713306
H  3.058589 -0.655446 2.284828
H  -0.61286 -5.652274 -0.770439
H  1.062563 -5.548539 -0.083459
H  -0.375358 -5.5076 1.018886
