program: Gaussian 09
title: 000178452
version: EM64L-G09RevD.01
frameworkgroup: C1[X(C13H17BrN4OS)]
method: RPBEPBE
basis: SDD
operation: Freq
keyword: #p
keyword: freq=noraman
keyword: PBEPBE/SDD
title: #p freq=noraman PBEPBE/SDD
converged: YES YES NO NO
title: Mulliken charges:
elementType: Br S O N N N N C C C C C C C C C C C C C H H H H H H H H H H H H H H H H H
charge: -0.017868 0.219514 -0.412420 -0.196777 0.036153 -0.033842 -0.019376 -0.255557 -0.310541 0.581022 0.368529 -0.743706 -0.449189 -0.214277 -0.643427 -0.502006 -0.425429 0.243608 -0.771924 -0.804961 0.243025 0.275653 0.244892 0.229766 0.230334 0.338362 0.254189 0.257904 0.249049 0.248298 0.242476 0.230275 0.256152 0.232374 0.285939 0.240539 0.293247
chargesum: 0.00000
title: Mulliken charges with hydrogens summed into heavy atoms:
elementType: Br S O N N N N C C C C C C C C C C C C C
charge: -0.017868 0.219514 -0.074058 -0.196777 0.036153 -0.033842 -0.019376 -0.012532 -0.034889 0.581022 0.368529 -0.038714 -0.449189 -0.214277 0.117715 -0.253708 -0.182953 0.243608 -0.053123 0.014764
polarizability: 2.96321763e+02 -4.91757051e+00 2.11018317e+02 1.73516146e+01 4.99194326e+00 1.16953957e+02
1716.lowfreq: -56.7651 -5.7113 -2.9216 0.0009 0.0019 0.0022 2.9911 15.0940 21.8291
frequency: -56.7527 14.6131 21.8097 30.8839 38.3726 48.6209 69.3282 96.6624 104.5846 110.1638 116.3137 124.1178 141.8078 155.8887 177.6171 202.9816 217.0353 246.7337 256.7361 275.7570 287.8393 288.6416 333.8124 346.0196 356.0229 388.6240 405.5449 442.4050 464.9354 484.8879 546.5995 561.6475 585.9230 631.7117 654.9913 657.7636 683.7040 694.7608 734.6879 776.6058 800.1073 835.3903 885.2133 901.9524 943.0817 947.7243 968.7278 984.4290 987.5333 996.2055 1003.2533 1015.7411 1050.6974 1073.4662 1091.8601 1102.2503 1120.9788 1163.4097 1194.5780 1207.1426 1226.4937 1238.0929 1253.7487 1258.5774 1284.1153 1306.7009 1315.0556 1333.2173 1343.3568 1357.4420 1364.4563 1375.5148 1382.2022 1393.2463 1408.0574 1434.3806 1453.4477 1454.5643 1458.7131 1463.1319 1468.1955 1470.3226 1474.7398 1482.5410 1487.0350 1508.1390 1527.3482 1547.3626 2984.2674 2986.0853 2999.5199 3007.3927 3029.1259 3056.4249 3064.9746 3083.9160 3087.6934 3092.3644 3111.7637 3116.9265 3125.2714 3130.4194 3157.1453 3163.4179 3520.0109
redmass: 1.0280 5.1208 5.3097 3.4053 4.9667 4.8825 4.1927 2.9769 1.5805 1.9565 1.7061 3.5158 4.3367 5.1525 2.9589 1.2492 3.4827 2.9709 3.3691 4.8725 14.1337 5.2861 2.0896 1.6424 2.9376 4.7226 3.5227 4.3912 6.1435 5.3725 4.8888 4.0423 4.4266 9.1980 11.7925 7.5475 8.8677 5.2744 4.6187 3.5531 3.7326 5.2008 2.3038 1.5850 1.9003 2.2728 1.7598 3.8284 1.1958 2.9533 1.2763 2.0496 1.6023 2.4917 1.9125 2.2327 1.3221 2.5558 1.6531 9.2337 3.9400 2.2393 2.0278 3.2486 2.7558 1.4644 1.4518 2.3193 1.4286 1.5752 3.6216 2.3168 1.2232 1.2448 1.7200 1.0522 1.2199 1.0834 1.2959 2.1397 1.0459 1.0466 1.0665 1.1334 1.1090 3.8650 6.9793 5.6794 1.0348 1.0380 1.0341 1.0840 1.0276 1.0855 1.0974 1.0995 1.1007 1.1025 1.1009 1.0983 1.0922 1.0928 1.1050 1.1063 1.0663
irintensity: 0.4585 0.5965 0.3100 1.6917 0.9191 1.3419 2.6337 3.6165 0.0493 1.2369 0.3960 0.5065 0.0960 1.0418 0.7353 0.4775 2.9669 0.3828 5.1037 4.7628 1.3198 1.5140 31.7599 75.8086 53.1793 10.6490 14.3516 19.0088 7.2039 10.5221 3.2889 1.8915 3.1002 1.4447 0.5179 5.3282 1.1111 4.1598 13.4855 7.1138 21.6654 1.1894 37.9043 5.6882 33.7047 41.9961 6.8497 25.0609 7.8008 13.2572 5.2135 34.6709 10.1033 16.4974 0.1062 35.4441 1.3181 131.6542 12.0839 74.5513 4.7938 8.9110 5.1112 1.5434 22.7067 3.5322 12.2800 41.4238 16.4640 10.5799 44.8109 72.5824 26.4930 20.6273 16.0993 14.8316 29.8158 30.7526 26.8766 63.7121 15.9485 7.0752 32.2913 30.2589 37.6202 5.2359 16.6923 0.3244 21.0942 18.0404 27.9867 5.7863 21.9217 7.0152 17.0238 33.8224 26.4993 11.9320 9.6542 8.1626 49.1845 0.8083 7.4767 7.4785 12.2673
temp: 298.150 k
press: 1.00000 atm
elementType: 35 16 8 7 7 7 7 6 6 6 6 6 6 6 6 6 6 6 6 6 1 1 1 1 1 1 1 1 1 1 1 1 1 1 1 1 1
symmnumber: 1
zpe: 746696.0 jmol-1
zpe.correction: 0.284401 hartree
zpe.thermalcorrener: 0.306089 hartree
zpe.thermalcorrenthalpy: 0.307033 hartree
zpe.thermalcorrgfe: 0.229629 hartree
zpe.sumelectzpe: -1209.807046 hartree
zpe.sumelectthermal: -1209.785358 hartree
zpe.sumelectthermalent: -1209.784414 hartree
zpe.sumelectthermalfe: -1209.861819 hartree
dipole: 0.0121 -3.2819 0.8027
dipole: 3.3786
quadrupole: -121.5680 -129.3304 -139.9262
quadrupole: 2.8449 -1.1575 1.4701
quadrupole: 8.7069 0.9445 -9.6514 2.8449 -1.1575 1.4701
hfenergy: -1210.0914475 hartree
pointgroup: C01 [X(C13H17Br1N4O1S1)]
dipole: 0.0502403 1.2731595 -0.3787567 debye
polarizability: 296.0848054|0.7475577|211.0928742|-19.5932903|1.0816546|117.1163576 unknown
InChI: InChI=1S/C13H17BrN4OS/c1-7-5-16-9(6-15-7)8(2)11(19)10-12(14)17-13(20-4)18(10)3/h5-6,8,11,19H,1-4H3
charge 0 multiplicity 1
37 atoms
Br 1.829923 -3.149895 0.1474
S  5.201444 1.430192 -0.233635
O  -0.332444 -0.667719 1.746136
N  2.459898 0.91707 0.163853
N  3.717914 -0.957863 -0.091027
N  -2.585128 1.090693 -0.235589
N  -4.56023 -0.942496 -0.019866
C  -0.800067 -0.543454 -0.710968
C  0.081484 -0.030673 0.475462
C  1.559683 -0.177528 0.23678
C  -2.255742 -0.23123 -0.403835
C  -0.37762 0.108164 -2.051884
C  2.387371 -1.294217 0.08234
C  3.733259 0.391445 -0.041889
C  2.108471 2.337932 0.2979
C  -3.253078 -1.22861 -0.292654
C  -3.884606 1.379042 0.039664
C  -4.889709 0.377025 0.151496
C  -6.330133 0.713637 0.459904
C  6.493207 0.0589 -0.226151
H  -0.679399 -1.641332 -0.788311
H  -0.178764 1.031065 0.625321
H  0.679228 -0.112645 -2.28244
H  -0.520493 1.202964 -2.006863
H  -0.996336 -0.277629 -2.881374
H  -0.035953 -1.615774 1.73113
H  1.535473 2.691665 -0.576543
H  1.513547 2.500991 1.211926
H  3.034533 2.929306 0.378097
H  -3.00448 -2.28842 -0.419539
H  -4.133226 2.437663 0.177283
H  -6.76703 1.369147 -0.316285
H  -6.91962 -0.214863 0.509619
H  -6.421519 1.243501 1.426127
H  6.450723 -0.477337 0.731647
H  7.459855 0.568599 -0.35681
H  6.289563 -0.632217 -1.054823
