program: Gaussian 09
title: 000178406
version: EM64L-G09RevD.01
frameworkgroup: C1[X(C9H16O2)]
method: RPBEPBE
basis: SDD
operation: Freq
keyword: #pfreq=noraman
keyword: PBEPBE/SDD
title: #p freq=noraman PBEPBE/SDD
converged: YES YES NO NO
title: Mulliken charges:
elementType: O O C C C C C C C C C H H H H H H H H H H H H H H H H
charge: -0.293642 -0.277570 0.357958 0.343994 -0.477365 -0.409348 -0.379974 -0.430037 -0.477832 -0.745753 -0.707453 0.218151 0.210694 0.210318 0.206864 0.212407 0.207359 0.229100 0.213415 0.217322 0.223004 0.241865 0.222966 0.216932 0.219388 0.222406 0.224831
chargesum: 0.00000
title: Mulliken charges with hydrogens summed into heavy atoms:
elementType: O O C C C C C C C C C
charge: -0.293642 -0.277570 0.357958 0.343994 -0.048519 0.007834 0.039792 0.012478 -0.037506 -0.063990 -0.040829
polarizability: 1.16004504e+02 1.37133783e-01 9.28507878e+01 2.98617319e+00 -1.26257142e-01 8.53909512e+01
1716.lowfreq: -21.5566 -15.2756 -0.0004 -0.0003 0.0004 10.0927 88.0525 146.5811 160.0578
frequency: 87.8777 146.5806 160.0450 169.2506 214.3969 246.9348 257.6441 281.1694 308.3372 349.7633 376.6762 438.3417 466.5941 469.6099 573.6098 589.7838 605.4783 707.0451 765.8606 786.9025 790.7302 845.6303 862.2337 877.5886 894.0732 938.8357 948.5770 962.2329 988.6120 1013.4993 1035.8093 1069.8091 1075.2935 1101.8092 1135.5071 1156.1460 1172.7344 1198.2022 1210.5713 1234.6831 1235.8711 1266.1388 1301.9549 1318.0130 1331.4623 1341.0478 1347.2732 1358.2257 1388.3412 1397.1223 1442.7930 1448.8519 1459.3747 1464.2146 1469.7853 1473.3755 1483.6652 1486.6998 1490.7834 2981.2680 2984.8524 2990.8651 2993.0817 2993.6570 2999.8964 3004.0139 3040.1511 3044.0505 3049.9315 3053.1785 3066.2507 3076.6898 3081.5620 3103.1521 3115.7604
redmass: 2.2500 2.5000 1.5521 1.4767 1.3521 1.9866 2.3336 2.1510 2.7721 2.5333 2.1218 3.2810 3.2876 3.6269 3.2434 2.4830 4.1400 4.5913 2.3792 1.3716 5.0574 2.6508 1.6711 2.5349 2.0027 1.8903 2.4735 3.0635 2.2965 1.4734 1.4910 2.2537 1.5842 2.1320 1.3443 2.1793 1.3634 2.1271 1.6680 1.8437 2.3274 1.3393 1.5183 1.3551 1.4842 1.5081 1.4513 1.7650 1.3383 1.2089 1.0880 1.0845 1.0542 1.0483 1.0720 1.0774 1.0479 1.0704 1.0783 1.0365 1.0585 1.0572 1.0600 1.0587 1.0616 1.0387 1.1012 1.1013 1.1051 1.1039 1.1034 1.0997 1.0999 1.0994 1.1002
irintensity: 0.0477 2.5979 0.7108 0.5000 1.6148 1.5811 2.4291 2.4740 2.7853 1.3950 0.5600 3.0317 0.7600 6.6210 3.8133 1.7431 2.6555 7.7196 16.4976 20.7387 19.4662 16.5533 4.2935 8.2099 6.8647 7.2577 23.8054 84.5598 19.3104 0.2070 9.5743 5.2176 9.8921 20.3990 3.3202 12.0579 11.6672 46.2230 5.6071 4.5974 28.4691 2.6940 9.3077 2.7502 3.5518 13.9646 1.5993 6.6595 41.8505 14.9354 4.1951 4.3965 7.6657 9.8654 2.5094 14.4697 10.6211 15.1704 1.7930 18.5178 22.5029 76.1294 30.2317 35.1239 26.7119 21.5467 9.9227 10.3828 38.6897 16.6058 46.1650 56.4703 52.2552 21.8989 18.8862
temp: 298.150 k
press: 1.00000 atm
elementType: 8 8 6 6 6 6 6 6 6 6 6 1 1 1 1 1 1 1 1 1 1 1 1 1 1 1 1
symmnumber: 1
zpe: 619652.7 jmol-1
zpe.correction: 0.236013 hartree
zpe.thermalcorrener: 0.246997 hartree
zpe.thermalcorrenthalpy: 0.247941 hartree
zpe.thermalcorrgfe: 0.200584 hartree
zpe.sumelectzpe: -502.107894 hartree
zpe.sumelectthermal: -502.096911 hartree
zpe.sumelectthermalent: -502.095967 hartree
zpe.sumelectthermalfe: -502.143324 hartree
dipole: 1.2650 1.4787 -0.1993
dipole: 1.9561
quadrupole: -63.0017 -67.0611 -71.2606
quadrupole: -1.4659 2.9732 -0.1770
quadrupole: 4.1061 0.0467 -4.1528 -1.4659 2.9732 -0.1770
hfenergy: -502.3439076 hartree
pointgroup: C01 [X(C9H16O2)]
dipole: -0.5026486 0.5811082 0.0441639 debye
polarizability: 115.8571827|0.1386647|92.8498002|3.6614856|-0.1477386|85.5392604 unknown
InChI: InChI=1S/C9H16O2/c1-3-9-6-4-5-8(2,11-9)10-7-9/h3-7H2,1-2H3
charge 0 multiplicity 1
27 atoms
O  0.261022 -0.63937 0.961177
O  1.026606 -0.673828 -1.257168
C  -0.857876 -0.067933 0.132982
C  1.454753 -0.354551 0.146083
C  -0.768216 1.474704 0.241045
C  1.778715 1.153984 0.247835
C  -0.455174 -0.580955 -1.281156
C  0.594665 1.999113 -0.284918
C  -2.158287 -0.672265 0.680787
C  2.577899 -1.295107 0.546645
C  -3.416616 -0.319273 -0.143854
H  -0.894869 1.740679 1.308345
H  -1.595029 1.949412 -0.321371
H  2.696368 1.374933 -0.328013
H  1.98121 1.383915 1.311668
H  -0.870776 -1.587743 -1.474823
H  -0.754585 0.109869 -2.090618
H  0.604218 1.958655 -1.390318
H  0.724542 3.060401 -0.002586
H  -2.288076 -0.333424 1.726332
H  -2.026955 -1.770658 0.716871
H  2.222212 -2.336956 0.501438
H  3.429961 -1.179094 -0.144408
H  2.919015 -1.074832 1.572872
H  -3.613737 0.767936 -0.149992
H  -3.324434 -0.655064 -1.193622
H  -4.306056 -0.814746 0.284665
