program: Gaussian 09
title: 000178456
version: EM64L-G09RevD.01
frameworkgroup: C1[X(C13H17BrN4OS)]
method: RPBEPBE
basis: SDD
operation: Freq
keyword: #p
keyword: freq=noraman
keyword: PBEPBE/SDD
title: #p freq=noraman PBEPBE/SDD
converged: YES YES NO NO
title: Mulliken charges:
elementType: Br S O N N N N C C C C C C C C C C C C C H H H H H H H H H H H H H H H H H
charge: -0.016817 0.219290 -0.412720 -0.196884 0.036635 -0.041221 0.017911 -0.275350 -0.311483 0.580253 0.335114 -0.743992 -0.449034 -0.214211 -0.643420 -0.462453 0.219695 -0.413021 -0.782293 -0.804780 0.245802 0.274716 0.245765 0.228650 0.231138 0.339087 0.253479 0.257644 0.249380 0.250822 0.249369 0.245524 0.242576 0.224736 0.285913 0.240693 0.293488
chargesum: 0.00000
title: Mulliken charges with hydrogens summed into heavy atoms:
elementType: Br S O N N N N C C C C C C C C C C C C C
charge: -0.016817 0.219290 -0.073633 -0.196884 0.036635 -0.041221 0.017911 -0.029548 -0.036767 0.580253 0.335114 -0.038439 -0.449034 -0.214211 0.117082 -0.211631 0.219695 -0.163651 -0.069458 0.015314
polarizability: 2.81495633e+02 -6.14854706e+00 2.21633409e+02 1.65138292e+01 3.86479757e+00 1.16530933e+02
1716.lowfreq: -4.1015 -2.4369 -0.0022 -0.0021 -0.0019 5.0080 16.5665 22.5119 26.4601
frequency: 16.4622 22.3654 26.4111 39.7257 46.1756 73.3884 80.3469 96.3214 102.0521 107.5574 117.8608 124.5305 154.8407 159.5365 178.2309 209.2944 216.3483 225.5891 255.9729 277.0366 278.9997 287.7167 301.4814 333.6943 347.6818 392.9508 438.2475 456.6393 471.3220 492.0468 544.6731 574.3658 591.6667 621.2049 654.9076 657.1381 677.4962 696.8715 707.6414 763.5388 792.3400 877.9324 880.8954 919.3051 929.5117 947.9355 963.4259 984.2802 986.4221 1002.6755 1006.8252 1045.5901 1054.2011 1069.5330 1095.6650 1103.1832 1122.0990 1137.9391 1166.1308 1200.6782 1207.4125 1228.6182 1238.0502 1265.7198 1279.2160 1308.6145 1331.5068 1339.7808 1343.4533 1364.5278 1375.9609 1381.5994 1392.3625 1401.0387 1409.7985 1417.1021 1433.9513 1454.2494 1456.9848 1459.1953 1469.0115 1471.2781 1474.5857 1482.4432 1486.8087 1511.5961 1527.3473 1543.5157 2985.1923 2990.7125 2999.7234 3009.4659 3029.0797 3056.3551 3076.5341 3084.1408 3089.2148 3092.8017 3102.2526 3111.4014 3132.7273 3139.3696 3157.0910 3163.5492 3521.2195
redmass: 5.5085 4.9675 3.3126 4.4423 4.9941 1.4452 2.1880 1.6323 2.2632 1.4876 2.5687 4.0251 4.4977 3.5319 2.8031 3.7153 2.6626 1.4256 3.3511 4.6335 4.2230 14.0808 4.0246 1.5772 1.7954 5.4562 4.7587 5.8993 5.7271 5.1722 5.3781 4.4916 5.2613 4.1668 11.7526 7.5831 8.1831 5.4367 5.9090 2.7421 3.5443 1.5730 2.2318 2.9670 1.4990 3.7482 3.0098 3.7964 1.2287 1.2773 2.1462 1.6124 2.9419 2.4013 1.8494 2.2677 1.3224 2.5886 2.6214 1.4557 9.2290 4.6924 1.7065 2.1419 1.9709 1.4444 2.7568 1.5618 1.4168 3.6727 2.2843 1.3058 1.4573 1.6646 1.7659 2.2416 1.0524 1.0732 1.0466 1.2966 1.1232 1.0509 1.0499 1.0718 1.1117 8.0254 6.9293 4.2609 1.0347 1.0367 1.0341 1.0839 1.0276 1.0855 1.0974 1.0994 1.1007 1.1025 1.1000 1.1009 1.0909 1.0948 1.1050 1.1063 1.0663
irintensity: 0.1761 0.3703 2.3363 0.2619 2.1643 0.2111 1.5241 3.6016 0.5780 1.3434 0.2059 0.7141 0.7254 0.3980 1.4732 4.1530 0.8077 1.1692 5.3091 5.2520 0.3770 0.6860 3.3321 64.8091 75.0230 28.1722 21.2920 4.4202 4.4869 12.2221 2.1523 4.9767 2.9107 1.5406 0.5697 5.4105 0.4653 2.3831 5.5129 7.3246 37.0011 7.8639 24.4883 20.5712 1.0568 68.1123 9.2281 24.6783 8.5272 4.2685 16.1491 15.0722 8.9672 11.4515 0.7405 40.1381 1.6226 8.2786 138.7735 18.7126 73.4220 2.3171 9.4956 23.5130 11.7499 4.3003 40.0936 10.2656 7.6115 49.4450 64.6706 33.8396 21.0276 7.5568 6.4329 61.3000 14.7661 31.0620 15.4348 28.1342 25.2818 12.5515 25.2704 11.4779 35.9297 64.5765 14.2755 10.9816 19.8918 14.9488 28.5754 5.3101 21.6877 7.1819 12.2356 32.4215 26.2267 12.2517 17.3112 9.2436 34.0031 9.3901 7.3812 7.3589 11.8216
temp: 298.150 k
press: 1.00000 atm
elementType: 35 16 8 7 7 7 7 6 6 6 6 6 6 6 6 6 6 6 6 6 1 1 1 1 1 1 1 1 1 1 1 1 1 1 1 1 1
symmnumber: 1
zpe: 747088.6 jmol-1
zpe.correction: 0.284551 hartree
zpe.thermalcorrener: 0.307031 hartree
zpe.thermalcorrenthalpy: 0.307975 hartree
zpe.thermalcorrgfe: 0.228729 hartree
zpe.sumelectzpe: -1209.807194 hartree
zpe.sumelectthermal: -1209.784715 hartree
zpe.sumelectthermalent: -1209.783770 hartree
zpe.sumelectthermalfe: -1209.863017 hartree
dipole: 0.5137 -3.9006 0.8911
dipole: 4.0339
quadrupole: -128.6156 -128.4963 -139.9649
quadrupole: 5.8608 -1.5803 1.5633
quadrupole: 3.7434 3.8626 -7.6060 5.8608 -1.5803 1.5633
hfenergy: -1210.0917453 hartree
pointgroup: C01 [X(C13H17Br1N4O1S1)]
dipole: 0.273998 1.5053137 -0.4215353 debye
polarizability: 281.7523969|2.4618402|221.3849363|-17.4085357|-0.1559439|116.5226417 unknown
InChI: InChI=1S/C13H17BrN4OS/c1-7-5-15-6-9(16-7)8(2)11(19)10-12(14)17-13(20-4)18(10)3/h5-6,8,11,19H,1-4H3
charge 0 multiplicity 1
37 atoms
Br 1.856762 -3.155757 0.195158
S  5.013438 1.567779 -0.255541
O  -0.411728 -0.736461 1.773386
N  2.298284 0.935946 0.153306
N  3.640136 -0.882922 -0.07905
N  -2.754893 0.84509 -0.224788
N  -4.622543 -1.285269 0.008788
C  -0.894046 -0.701901 -0.683818
C  -0.033551 -0.115595 0.483019
C  1.448838 -0.197586 0.241327
C  -2.363691 -0.457877 -0.375738
C  -0.514152 -0.061549 -2.042897
C  2.326539 -1.277504 0.100713
C  3.594014 0.466161 -0.047855
C  1.883421 2.340877 0.270845
C  -3.303395 -1.512202 -0.255744
C  -4.072937 1.094153 0.048632
C  -4.996005 0.018624 0.158776
C  -4.488333 2.534379 0.228622
C  6.366343 0.256822 -0.22931
H  -0.717932 -1.793423 -0.737019
H  -0.345567 0.935623 0.605254
H  0.550864 -0.234695 -2.276015
H  -0.711321 1.025529 -2.021894
H  -1.117636 -0.497374 -2.858726
H  -0.069611 -1.669026 1.783624
H  1.304746 2.662137 -0.612424
H  1.2729 2.485117 1.177611
H  2.781967 2.972836 0.35543
H  -2.99861 -2.55826 -0.368785
H  -6.053788 0.202951 0.374428
H  -3.962726 2.980023 1.09258
H  -4.212579 3.129619 -0.659943
H  -5.574637 2.62562 0.394111
H  6.350024 -0.265572 0.73689
H  7.308583 0.807736 -0.370461
H  6.192621 -0.455651 -1.046592
