program: Gaussian 09
title: 000178423
version: EM64L-G09RevD.01
frameworkgroup: C1[X(C18H15N3O2S)]
method: RPBEPBE
basis: SDD
operation: Freq
keyword: #p
keyword: freq=noraman
keyword: PBEPBE/SDD
title: #p freq=noraman PBEPBE/SDD
converged: YES YES NO NO
title: Mulliken charges:
elementType: S O O N N N C C C C C C C C C C C C C C C C C C H H H H H H H H H H H H H H H
charge: 0.252289 -0.234420 -0.152474 -0.068143 -0.417300 -0.056749 -0.678859 -0.320393 0.524359 0.186860 -0.163286 -0.414221 -0.356260 0.270305 0.280632 0.037217 -0.219489 -0.234501 -0.741445 -0.239430 -0.359751 -0.342860 -0.214462 -0.227785 0.376499 0.300821 0.251518 0.266324 0.317598 0.229909 0.225940 0.255109 0.253673 0.251047 0.234109 0.229513 0.247174 0.225005 0.225927
chargesum: 0.00000
title: Mulliken charges with hydrogens summed into heavy atoms:
elementType: S O O N N N C C C C C C C C C C C C C C C C C C
charge: 0.252289 -0.234420 -0.152474 -0.068143 -0.099703 -0.056749 -0.302361 -0.019572 0.524359 0.186860 -0.163286 -0.162703 -0.089936 0.270305 0.280632 0.037217 0.010421 -0.008561 0.018383 -0.009916 -0.125642 -0.095685 0.010543 -0.001858
polarizability: 3.27199594e+02 -5.24426972e-01 1.80964540e+02 -2.72907491e+01 1.98896455e+01 2.06006833e+02
1716.lowfreq: -8.0757 -4.7597 -0.7836 0.0011 0.0011 0.0012 12.8153 25.4009 27.4719
frequency: 12.4292 25.3989 27.4336 30.8105 56.6418 63.6020 88.0827 99.5800 134.2639 150.1221 156.8963 167.5783 189.3161 221.6676 247.8314 266.9770 292.4952 300.3731 330.3949 389.7736 403.7657 423.3175 427.5546 481.0292 502.5393 521.4993 563.0457 568.8012 578.3647 583.4792 590.1645 600.6486 611.9586 614.4175 649.1071 655.2348 699.9010 708.9627 744.3917 751.7353 764.9856 770.7352 785.6549 794.5522 804.1180 854.8795 855.8145 856.5407 878.0221 915.8091 932.3699 933.5042 934.1196 974.8917 980.4301 989.8987 997.7073 1005.4121 1007.7659 1013.5052 1029.2266 1051.1531 1082.9871 1107.7877 1110.7104 1153.7128 1162.9812 1173.3997 1180.9614 1192.5736 1208.6041 1213.9347 1217.5387 1232.3282 1249.3953 1260.8250 1278.2986 1311.7498 1342.6121 1354.5102 1389.8411 1399.3857 1411.4207 1415.9622 1444.9983 1452.1931 1455.6335 1459.1365 1477.1442 1482.0394 1590.5540 1594.9825 1610.8283 1630.6807 1644.3484 1741.6560 3003.4992 3013.5835 3027.0254 3086.5053 3124.6477 3131.9272 3134.0861 3135.6055 3144.3926 3145.5561 3154.0074 3159.6941 3166.5142 3172.9688 3597.5526
redmass: 6.5049 5.3504 4.8415 4.4825 6.1840 4.7356 5.7788 6.6735 1.6183 2.6587 4.8609 6.5628 5.3479 6.3267 4.5002 4.6173 4.2794 5.2094 6.8353 11.1842 2.8407 5.1702 2.9940 5.3069 5.0907 4.4076 4.2634 1.3285 3.8219 7.1873 6.2967 5.7405 6.5960 6.4282 5.5633 5.7672 3.0996 2.2986 4.1849 1.3600 3.5600 3.3955 4.2585 5.1971 8.2939 1.4748 1.6006 2.5616 6.5452 2.9833 1.8500 1.5239 3.4107 1.3052 1.3909 6.0268 1.3331 6.0831 2.0790 2.2396 2.1585 1.5417 1.6507 1.7158 3.1285 1.7303 1.2268 1.0552 1.7975 1.1190 2.7790 2.2801 1.7370 1.4576 1.3831 3.1998 2.0002 1.4943 3.0645 1.5058 4.0452 1.2730 3.0202 3.7670 2.0619 1.0451 1.0635 4.2700 2.7893 2.2740 5.9217 6.8519 5.9931 7.4931 8.9415 13.0088 1.0375 1.0824 1.0863 1.0973 1.0848 1.0854 1.0879 1.0998 1.0905 1.0927 1.0965 1.0959 1.1015 1.0993 1.0815
irintensity: 0.3095 1.3037 1.9036 0.4675 0.4819 1.3462 1.8108 2.9922 1.1087 0.4600 0.0778 0.5569 3.7756 0.5824 6.2916 3.6780 0.3756 0.1619 3.9429 4.0904 0.1651 7.5062 8.4937 1.7754 10.1940 19.1733 27.6403 62.7448 1.7631 5.7346 7.8605 8.4131 6.6387 1.5563 43.8480 18.4914 13.1803 138.5726 10.3315 109.4506 8.2102 9.2130 87.1611 0.2143 85.8468 2.8444 1.1140 2.1430 3.8052 9.8904 1.6528 6.1499 6.9947 0.0420 0.4506 0.7039 1.0104 75.1085 11.8454 4.5702 4.4470 6.3149 11.4273 2.0618 8.7279 20.0429 16.7694 0.1456 82.2450 0.6867 11.1805 5.1012 33.0671 16.4627 11.3492 72.3375 13.9461 5.0864 79.1153 1.6538 5.2502 38.0195 91.1653 179.8515 12.1430 18.1298 30.0467 12.9566 18.7270 9.1691 0.8998 2.2593 0.2081 1.7461 170.7472 186.7339 3.6772 5.1975 28.5308 5.9060 1.0693 0.2349 5.0985 4.8845 12.2094 19.9098 19.4098 26.4316 17.7685 19.3504 51.8825
temp: 298.150 k
press: 1.00000 atm
elementType: 16 8 8 7 7 7 6 6 6 6 6 6 6 6 6 6 6 6 6 6 6 6 6 6 1 1 1 1 1 1 1 1 1 1 1 1 1 1 1
symmnumber: 1
zpe: 767380.3 jmol-1
zpe.correction: 0.292280 hartree
zpe.thermalcorrener: 0.313086 hartree
zpe.thermalcorrenthalpy: 0.314030 hartree
zpe.thermalcorrgfe: 0.239057 hartree
zpe.sumelectzpe: -1406.002865 hartree
zpe.sumelectthermal: -1405.982059 hartree
zpe.sumelectthermalent: -1405.981115 hartree
zpe.sumelectthermalfe: -1406.056088 hartree
dipole: 0.0039 0.2005 -4.2795
dipole: 4.2842
quadrupole: -121.9423 -140.3455 -146.0275
quadrupole: -0.5436 -6.0366 3.8721
quadrupole: 14.1628 -4.2404 -9.9224 -0.5436 -6.0366 3.8721
hfenergy: -1406.2951446 hartree
pointgroup: C01 [X(C18H15N3O2S1)]
dipole: -0.1265555 0.049379 -1.6800381 debye
polarizability: 321.6622108|11.0553527|182.3151292|-37.3222991|17.4753479|210.1936269 unknown
InChI: InChI=1S/C18H15N3O2S/c1-11-19-15(17(22)23-11)16(12-7-3-2-4-8-12)24-18-20-13-9-5-6-10-14(13)21-18/h2-10,15-16,20H,1H3
charge 0 multiplicity 1
39 atoms
S  -0.136722 -1.294831 -1.404684
O  4.373505 -0.575745 0.783693
O  2.77433 -0.554969 2.513278
N  3.096443 -1.329372 -1.022794
N  -2.925689 -1.103419 -1.413163
N  -1.984159 -0.606891 0.607372
C  0.915585 -0.427036 -0.039197
C  2.185724 -1.290183 0.155083
C  1.151886 1.039316 -0.339633
C  3.047781 -0.772781 1.332632
C  -1.752566 -0.964222 -0.66237
C  0.711687 2.005218 0.601492
C  1.801925 1.473823 -1.525644
C  4.268154 -0.931808 -0.61465
C  -4.004308 -0.815246 -0.55495
C  -3.393101 -0.500242 0.707496
C  0.933465 3.381938 0.371634
C  2.020536 2.848893 -1.753728
C  5.527771 -0.785858 -1.395081
C  1.590851 3.807327 -0.80458
C  -5.399249 -0.798129 -0.746659
C  -4.199159 -0.156328 1.814713
C  -6.188319 -0.450708 0.373042
C  -5.598499 -0.136344 1.631291
H  0.284129 -0.537155 0.860834
H  1.855992 -2.322464 0.383229
H  0.190387 1.674836 1.506722
H  2.112171 0.734038 -2.271227
H  -2.977213 -1.335298 -2.403501
H  0.589464 4.118178 1.10634
H  2.518252 3.176219 -2.673679
H  5.875951 0.262013 -1.367511
H  5.35194 -1.087976 -2.437895
H  6.32874 -1.409124 -0.959961
H  -5.861163 -1.039363 -1.709647
H  1.759573 4.874912 -0.985469
H  -3.742547 0.081825 2.780027
H  -7.278671 -0.423279 0.271023
H  -6.248275 0.125236 2.473421
